{"text_format":"1","workbook":"xlsx","n_sheets":10,"sheets":["Information","Input page Early Years","Record form Early Years","Shared Abilities EY","DAS-II UEY Summary","Input page School-age","Record form School-age","Shared Abilities SA","DAS-II SA Summary","DAS-II Culture Linguistic"],"not_rendered":{"charts":6,"images":0,"macros":1,"external_links":1,"defined_names":85,"comments":0,"pivot_tables":0},"unopened":[],"bounds":{"document_bytes":16777216,"sheet_cells":100000,"rows_first":2000,"rows_last":500,"rows_between":2000,"halvings":0,"cell_chars":16384,"cell_head_chars":4096},"cells_cut":0,"cells_raw":0,"read":"whole","date_system":"1900"}

{"sheet":"Information","index":0,"n_rows":20,"n_cols":1,"rows_kept":20,"cut":false,"hidden":false,"merged":[]}
["These template sheets come with some scores already entered into cells."]
[]
["These scores act as placeholders and demonstrate what scores are necessary. The only sheets that require any user input are the "]
["           \"Input page Early Years\" (green tab below) and the"]
["           \"Input page School-Age\" (blue tab below)."]
["All cells, except those requiring entry, are protected.  Use the mouse or the TAB key to move from input cell to input cell."]
[]
["****Be sure to delete any scores that do not pertain to your particular case.****"]
[]
["We, Ron Dumont and John Willis, and NCS Pearson, take no responsibility for any errors made while using these templates."]
[]
["There may be some differences between some of the templates reporting and data in the DAS-II Manuals."]
[]
["The Percentiles reported here are simple SS to Percentile lookups.  They are based upon the normal curve distribution."]
[]
["The Composite and FSIQ ranges are based upon a Standard Error of Estimate formula (SEe)."]
[]
["For updates for this template - check the webpages at: "]
[]
["http://alpha.fdu.edu/~dumont/psychology/"]

{"sheet":"Input page Early Years","index":1,"n_rows":58,"n_cols":28,"rows_kept":58,"cut":false,"hidden":false,"merged":[[38,11,39,11],[38,13,39,13],[15,1,15,2],[16,1,16,2],[17,1,17,2],[18,1,18,2],[19,1,19,2],[34,1,34,2],[38,7,39,7],[38,9,39,9],[13,11,14,11],[13,13,14,13],[5,7,6,7],[13,3,14,3],[13,5,14,5],[13,7,14,7],[13,9,14,9],[47,1,47,2],[38,1,38,2],[36,1,36,2],[1,3,1,7],[32,3,33,3],[35,1,35,2],[13,1,14,2]]}
[]
[null,"Name: ",null,"A D",null,null,null,null,null,null,null,null,null,null,null,null,null,null,null,{"$f":"YEAR(D3)","v":2008},{"$f":"MONTH(D3)","v":11},{"$f":"DAY(D3)","v":17},{"$f":"IF(X3>Y2,T2-1,T2)","v":2008},{"$f":"IF(X3>Y2,Y2+12,Y2)","v":11},{"$f":"IF(Z3>V2,U2-1,U2)","v":11},{"$f":"IF(Z3>V2,V2+30,V2)","v":17}]
[null,"Date of Test:",null,"2008-11-17",null,null,null,"Age:",null,{"$f":"AB4","v":"4 years, 6 months, 0 days"},null,null,null,null,null,null,null,null,null,null,null,null,{"$f":"YEAR(D4)","v":2004},{"$f":"MONTH(D4)","v":5},null,{"$f":"DAY(D4)","v":17}]
[null,"Date of Birth:",null,"2004-05-17",null,null,null,"Date Analyzed: ",null,{"$f":"NOW()","v":"2014-02-11T13:44:26.090"},null,null,null,null,null,null,null,null,null,null,null,null,{"$f":"W2-W3","v":4},{"$f":"X2-X3","v":6},null,{"$f":"Z2-Z3","v":0},null,{"$f":"W4&\" years, \"&X4&X5&Z4&Z5","v":"4 years, 6 months, 0 days"}]
[null,null,null,null,null,null,null,null,null,null,null,null,null,null,null,null,null,null,null,null,null,null,null,{"$f":"IF(X4=1,\" month, \",\" months, \")","v":" months, "},null,{"$f":"IF(Z4=1,\" day\",\" days\")","v":" days"}]
[]
[null,null,null,"T Score"]
[null,"Verbal Comprehension (Gc)","VCom",53]
[null,"Picture Similarities (Gf)","PSim",56,null,null,null,null,null,null,null,null,null,null,null,null,null,null,null,2]
[null,"Naming Vocabulary (Gc)","NVoc",62]
[null,"Pattern Construction (Gv)","PCon",46]
[null,{"$f":"IF(T9=2,\"Matrices (Gf)\",\"[Matrices (Gf)]\")","v":"Matrices (Gf)"},"Mat",63]
[null,{"$f":"IF(T9=2,\"Copying (Gv)\",\"[Copying (Gv)]\")","v":"Copying (Gv)"},"Copy",49]
[null,null,null,"Standard Score"]
[]
[null,"Verbal",null,113]
[null,"Nonverbal Reasoning",null,117]
[null,"Spatial",null,95]
[null,"GCA",null,111,null,null,null,null,null,null,null,null,null,null,null,null,null,null,null,2]
[null,"SNV",null,107]
[null,null,null,"T Score"]
[null,"Recall of Objects-Immediate (Glr)","RObI",52]
[null,"Recall of Objects-Delayed (Glr)","RObD"]
[null,"Recall of Digits Forward (Gsm)","DigF",50]
[null,"Recognition of Pictures (Gv)","RPic",47]
[null,"Early Number Concepts (Gc/Gf)","ENC",48]
[null,"Matching Letter Like Forms (Gv)","MLLF",49]
[null,"Recall of Sequential Order (Gsm)","SeqO"]
[null,"Speed of Information Processing (Gs)","SIP"]
[null,"Recall of Digits Backward (Gsm)","DigB"]
[null,"Phonological Processing (Ga)","PhP"]
[null,"Rapid Naming (Gs)","RNam"]
[null,null,null,"Standard Score"]
[]
[null,"Working Memory"]
[null,"Processing Speed"]
[null,"School Readiness"]
[]
[null,"Phonological Processing (Ga)",null,"Ability",null,"SEm"]
[null,null,"Task 1 (Rhyming)"]
[null,null,null,"Ability",null,"SEm"]
[null,null,"Task 2 (Blending)"]
[null,null,null,"Ability",null,"SEm"]
[null,null,"Task 3 (Deletion)"]
[null,null,null,"Ability",null,"SEm"]
[null,null,"Task 4 (Phoneme Identification and Segmentation)"]
[]
[null,"Rapid Naming (Gs)",null,"Ability",null,"Sem"]
[null,null,"Simple Naming"]
[null,null,null,"Ability",null,"Seem"]
[null,null,"Complex Naming"]
[]
[]
[null,null,null,"T Score"]
[null,"Recall of Designs (Gv)","RDes"]
[null,"Word Definition (Gc)","WDef"]
[null,"Verbal Similarities (Gc)","VSim"]
[null,"Sequential & Quantitative Reasoning (Gf)","SQR"]

{"sheet":"Record form Early Years","index":2,"n_rows":372,"n_cols":203,"rows_kept":372,"cut":false,"hidden":false,"merged":[[262,3,262,4],[264,1,264,3],[265,3,265,4],[256,3,256,4],[258,1,258,4],[259,3,259,4],[261,1,261,3],[250,3,250,4],[252,1,252,3],[253,3,253,4],[255,1,255,2],[244,3,244,4],[246,1,246,4],[247,3,247,4],[249,1,249,3],[238,3,238,4],[240,1,240,4],[241,3,241,4],[243,1,243,4],[232,3,232,4],[234,1,234,2],[235,3,235,4],[237,1,237,4],[13,5,14,5],[226,3,226,4],[228,1,228,4],[229,3,229,4],[231,1,231,3],[221,1,221,3],[222,1,222,3],[223,3,223,4],[225,1,225,3],[1,2,1,3],[3,10,3,11],[2,2,2,5],[5,19,6,19],[220,1,220,11],[5,1,6,2],[25,1,26,2],[38,11,39,11],[13,1,14,3],[38,1,39,3],[13,7,14,7],[13,9,14,9],[13,11,14,11],[13,13,14,13],[1,10,1,11],[2,10,2,11],[13,10,14,10],[61,13,61,15],[50,2,50,5],[78,7,79,7],[45,5,45,7],[38,13,39,13],[38,5,39,5],[38,7,39,7],[38,9,39,9]]}
[]
[null,"Name: ",{"$f":"IF('Input page Early Years'!D2=\"\",\"\",'Input page Early Years'!D2)","v":"A D"},null,null,null,null,null,null,"Date of Test:",{"$f":"IF('Input page Early Years'!D3=\"\",\"\",'Input page Early Years'!D3)","v":"2008-11-17"}]
[null,"Age:",{"$f":"IF('Input page Early Years'!J3=\"\",\"\",'Input page Early Years'!J3)","v":"4 years, 6 months, 0 days"},null,null,null,null,null,null,"Date of Birth:",{"$f":"IF('Input page Early Years'!D4=\"\",\"\",'Input page Early Years'!D4)","v":"2004-05-17"}]
[null,null,null,null,null,null,null,null,null,"Date Analyzed:",{"$f":"NOW()","v":"2014-02-11T13:44:26.090"},null,null,null,null,null,null,null,null,{"$f":"'Input page Early Years'!T9","v":2}]
[]
[null,"Core Subtest T Scores",null,null,null,"Verbal",null,{"$f":"IF('Input page Early Years'!T9=1, \"Nonverbal\",\"Nonverbal Reasoning\")","v":"Nonverbal Reasoning"},null,"Spatial",null,"GCA",null,"SNV",null,null,null,null,null,"Standard Score"]
[null,null,null,"T Score",null,{"$f":"IF('Input page Early Years'!T9=1,\"Lower\",\"Upper\")","v":"Upper"},null,{"$f":"IF('Input page Early Years'!T9=1,\"Lower\",\"Upper\")","v":"Upper"},null,{"$f":"IF('Input page Early Years'!T9=1,\"\",\"Upper\")","v":"Upper"},null,{"$f":"IF('Input page Early Years'!T9=1,\"Lower\",\"Upper\")","v":"Upper"},null,{"$f":"IF('Input page Early Years'!T9=1,\"\",\"Upper\")","v":"Upper"},null,"Percentile"]
[null,"Verbal Comprehension (Gc)","VCom",{"$f":"IF('Input page Early Years'!D8=\"\",\"\",'Input page Early Years'!D8)","v":53},null,{"$f":"IF(D8=\"\",\"\",D8)","v":53},null,null,null,null,null,{"$f":"IF(D8=\"\",\"\",D8)","v":53},null,null,null,{"$f":"IF(D8=\"\",\"\",LOOKUP(D8,ttopr))","v":62},null,null,null,{"$f":"100+((D8-50)/10)*15","v":104.5}]
[null,"Picture Similarities (Gf)","PSim",{"$f":"IF('Input page Early Years'!D9=\"\",\"\",'Input page Early Years'!D9)","v":56},null,null,null,{"$f":"IF(D9=\"\",\"\",D9)","v":56},null,null,null,{"$f":"IF(D9=\"\",\"\",D9)","v":56},null,{"$f":"IF('Input page Early Years'!T9=1,0,IF(D9=\"\",\"\",D9))","v":56},null,73,null,null,null,109]
[null,"Naming Vocabulary (Gc)","NVoc",{"$f":"IF('Input page Early Years'!D10=\"\",\"\",'Input page Early Years'!D10)","v":62},null,{"$f":"IF(D10=\"\",\"\",D10)","v":62},null,null,null,null,null,{"$f":"IF(D10=\"\",\"\",D10)","v":62},null,null,null,88,null,null,null,118]
[null,"Pattern Construction (Gv)","PCon",{"$f":"IF('Input page Early Years'!D11=\"\",\"\",'Input page Early Years'!D11)","v":46},null,null,null,{"$f":"IF(T4=1,D11,0)","v":0},null,{"$f":"IF('Input page Early Years'!T9=1,0,IF(D11=\"\",\"\",D11))","v":46},null,{"$f":"IF(D11=\"\",\"\",D11)","v":46},null,{"$f":"IF('Input page Early Years'!T9=1,0,IF(D11=\"\",\"\",D11))","v":46},null,34,null,null,null,94,null,{"$f":"COUNT(L8:L11)","v":4},{"$f":"COUNT(L8:L13)","v":6},{"$f":"COUNT(N8:N13)","v":4}]
[null,{"$f":"'Input page Early Years'!B12","v":"Matrices (Gf)"},"Mat",{"$f":"IF('Input page Early Years'!D12=\"\",\"\",'Input page Early Years'!D12)","v":63},null,null,null,{"$f":"IF('Input page Early Years'!T9=1,0,IF(D12=\"\",\"\",D12))","v":63},null,null,null,{"$f":"IF('Input page Early Years'!T9=1,0,IF(D12=\"\",\"\",D12))","v":63},null,{"$f":"IF('Input page Early Years'!T9=1,0,IF(D12=\"\",\"\",D12))","v":63},null,90,null,null,null,119.5,null,{"$f":"SUM(L8:L11)","v":217},{"$f":"SUM(L8:L13)","v":329},{"$f":"SUM(N8:N13)","v":214}]
[null,{"$f":"'Input page Early Years'!B13","v":"Copying (Gv)"},"Copy",{"$f":"IF('Input page Early Years'!D13=\"\",\"\",'Input page Early Years'!D13)","v":49},null,null,null,null,null,{"$f":"IF('Input page Early Years'!T9=1,0,IF(D13=\"\",\"\",D13))","v":49},null,{"$f":"IF('Input page Early Years'!T9=1,0,IF(D13=\"\",\"\",D13))","v":49},null,{"$f":"IF('Input page Early Years'!T9=1,0,IF(D13=\"\",\"\",D13))","v":49},null,48,null,null,null,98.5,null,{"$f":"IF(V11<4,\"\",ROUND((V12/4),0))","v":54},{"$f":"IF(W11<6,\"\",ROUND((W12/6),0))","v":55},{"$f":"IF(X11<4,\"\",ROUND((X12/4),0))","v":54}]
[null,"Cluster/Composite Scores",null,null,null,null,null,null,null,null,null,null,null,null,null,null,null,null,null,null,null,{"$f":"IF('Input page Early Years'!T9=1,V13,W13)","v":55}]
[null,null,null,null,null,null,null,null,null,null,null,null,null,null,null,null,null,null,null,null,null,2,{"$f":"IF(V15=1,90,95)","v":95}]
[null,null,null,"Sum of Core T scores",null,{"$f":"IF(COUNT(F8:F13)<2,\"\",\"(\"&SUM(F8:F15)&\")\")","v":"(115)"},null,{"$f":"IF('Input page Early Years'!T9=1,T16,T17)","v":"(119)"},null,{"$f":"IF('Input page Early Years'!T9=1,\"\",IF(COUNT(J8:J13)<2,\"\",\"(\"&SUM(J8:J15)&\")\"))","v":"(95)"},null,{"$f":"IF(COUNT(L8:L13)<6,\"\",\"(\"&SUM(L8:L15)&\")\")","v":"(329)"},null,{"$f":"IF('Input page Early Years'!T9=1,\"\",\"(\"&SUM(N8:N15)&\")\")","v":"(214)"},null,null,null,null,null,{"$f":"IF(AND('Input page Early Years'!T9=1,COUNT(H9:H11)<2),\"\",\"(\"&SUM(H9+H11)&\")\")","v":"(56)"},"v",0.9,{"$f":"100+V16*(F17-100)","v":111.7},{"$f":"15*SQRT((1-V16)*(V16))","v":4.5},{"$f":"IF($W$15=90,X16*1.65,X16*1.96)","v":8.82},{"$f":"ROUND(W16-Y16,0)","v":103},{"$f":"ROUND(W16+Y16,0)","v":121},{"$f":"SUM(F8:F13)","v":115},{"$f":"SUM(H8:H13)","v":119},{"$f":"SUM(J8:J13)","v":95},{"$f":"SUM(L8:L13)","v":329},{"$f":"SUM(N8:N13)","v":214},{"$f":"SUM(F33:F38)","v":0},{"$f":"SUM(H33:H38)","v":0},{"$f":"SUM(J32:J37)","v":97}]
[null,null,null,"Standard Score",null,{"$f":"IF('Input page Early Years'!D16=\"\",\"\",'Input page Early Years'!D16)","v":113},null,{"$f":"IF('Input page Early Years'!D17=\"\",\"\",'Input page Early Years'!D17)","v":117},null,{"$f":"IF('Input page Early Years'!D18=\"\",\"\",'Input page Early Years'!D18)","v":95},null,{"$f":"IF('Input page Early Years'!D19=\"\",\"\",'Input page Early Years'!D19)","v":111},null,{"$f":"IF('Input page Early Years'!D20=\"\",\"\",'Input page Early Years'!D20)","v":107},null,null,null,null,null,{"$f":"IF(AND('Input page Early Years'!T9=2,COUNT(H9:H12)<3),\"\",\"(\"&SUM(H9+H12)&\")\")","v":"(119)"},"nv",0.89,{"$f":"100+V17*(H17-100)","v":115.13},{"$f":"15*SQRT((1-V17)*(V17))","v":4.6933463541486038},{"$f":"IF($W$15=90,X17*1.65,X17*1.96)","v":9.1989588541312628},{"$f":"ROUND(W17-Y17,0)","v":106},{"$f":"ROUND(W17+Y17,0)","v":124},{"$f":"LOOKUP(AB16,Vts)","v":112},{"$f":"LOOKUP(AC16,NVts)","v":115},{"$f":"LOOKUP(AD16,Spts)","v":95},{"$f":"LOOKUP(AE16,gcasum)","v":109},{"$f":"LOOKUP(AF16,gcasum)","v":73},{"$f":"LOOKUP(AG16,wmss)","v":{"$error":"#N/A"}},{"$f":"LOOKUP(AH16,psss)","v":{"$error":"#N/A"}},{"$f":"LOOKUP(AI16,gcasum)","v":40}]
[null,null,null,"Percentile",null,{"$f":"IF(F17=\"\",\"\",LOOKUP(F17,sstopr))","v":81},null,{"$f":"IF(H17=\"\",\"\",LOOKUP(H17,sstopr))","v":87},null,{"$f":"IF(J17=\"\",\"\",LOOKUP(J17,sstopr))","v":37},null,{"$f":"IF(L17=\"\",\"\",LOOKUP(L17,sstopr))","v":77},null,{"$f":"IF(N17=\"\",\"\",LOOKUP(N17,sstopr))","v":68},null,null,null,null,null,null,"sp",0.95,{"$f":"100+V18*(J17-100)","v":95.25},{"$f":"15*SQRT((1-V18)*(V18))","v":3.2691742076555066},{"$f":"IF($W$15=90,X18*1.65,X18*1.96)","v":6.4075814470047927},{"$f":"ROUND(W18-Y18,0)","v":89},{"$f":"ROUND(W18+Y18,0)","v":102},"v","nv","sp","gca","snc","wm","ps","sr"]
[null,"Confidence Interval  ",null,null,null,{"$f":"IF(F18=\"\",\"\",Z16&\" to \"&AA16)","v":"103 to 121"},null,{"$f":"IF(H18=\"\",\"\",Z17&\" to \"&AA17)","v":"106 to 124"},null,{"$f":"IF(J18=\"\",\"\",Z18&\" to \"&AA18)","v":"89 to 102"},null,{"$f":"IF(L18=\"\",\"\",Z24&\" to \"&AA24)","v":"104 to 117"},null,{"$f":"IF(N18=\"\",\"\",Z25&\" to \"&AA25)","v":"100 to 113"},null,null,null,null,null,null,"sr",0.9,{"$f":"100+V19*(J42-100)","v":{"$error":"#VALUE!"}},{"$f":"15*SQRT((1-V19)*(V19))","v":4.5},{"$f":"IF($W$15=90,X19*1.65,X19*1.96)","v":8.82},{"$f":"ROUND(W19-Y19,0)","v":{"$error":"#VALUE!"}},{"$f":"ROUND(W19+Y19,0)","v":{"$error":"#VALUE!"}}]
[null,null,null,"Between Cluster Difference",null,{"$f":"IF(F17=\"\",\"\",V61)","v":""},null,{"$f":"IF(H17=\"\",\"\",IF(sp=\"\",\"\",V63))","v":"NVR > Sp"},null,{"$f":"IF(J17=\"\",\"\",V62)","v":"V > Sp"}]
[null,null,null,"Within Cluster Differences",null,{"$f":"IF(F17=\"\",\"\",V76)","v":""},null,{"$f":"IF('Input page Early Years'!T9=1,IF(H17=\"\",\"\",W77),IF(H17=\"\",\"\",V77))","v":""},null,{"$f":"IF(J17=\"\",\"\",V78)","v":""}]
[null,null,null,"Mean Core T Score",null,null,null,null,null,null,null,{"$f":"V14","v":55},null,{"$f":"IF('Input page Early Years'!T9=1,\"\",X13)","v":54},null,null,null,null,null,null,"wm",0.94,{"$f":"100+V22*(F42-100)","v":{"$error":"#VALUE!"}},{"$f":"15*SQRT((1-V22)*(V22))","v":3.5623026261113764},{"$f":"IF($W$15=90,X22*1.65,X22*1.96)","v":6.982113147178298},{"$f":"ROUND(W22-Y22,0)","v":{"$error":"#VALUE!"}},{"$f":"ROUND(W22+Y22,0)","v":{"$error":"#VALUE!"}}]
[null,null,null,null,null,"Verbal",null,"Nonverbal Reasoning",null,"Spatial",null,"GCA",null,"SNV",null,null,null,null,null,null,"ps",0.89,{"$f":"100+V23*(H42-100)","v":{"$error":"#VALUE!"}},{"$f":"15*SQRT((1-V23)*(V23))","v":4.6933463541486038},{"$f":"IF($W$15=90,X23*1.65,X23*1.96)","v":9.1989588541312628},{"$f":"ROUND(W23-Y23,0)","v":{"$error":"#VALUE!"}},{"$f":"ROUND(W23+Y23,0)","v":{"$error":"#VALUE!"}}]
[null,null,null,null,null,"(Gc)",null,"(Gf)",null,"(Gv)",null,"(g)",null,"(g)",null,null,null,null,null,null,"gca",0.95,{"$f":"100+V24*(L17-100)","v":110.45},{"$f":"15*SQRT((1-V24)*(V24))","v":3.2691742076555066},{"$f":"IF($W$15=90,X24*1.65,X24*1.96)","v":6.4075814470047927},{"$f":"ROUND(W24-Y24,0)","v":104},{"$f":"ROUND(W24+Y24,0)","v":117}]
[null,null,null,null,null,null,null,null,null,null,null,null,null,null,null,null,null,null,null,null,"snv",0.95,{"$f":"100+V25*(N17-100)","v":106.65},{"$f":"15*SQRT((1-V25)*(V25))","v":3.2691742076555066},{"$f":"IF($W$15=90,X25*1.65,X25*1.96)","v":6.4075814470047927},{"$f":"ROUND(W25-Y25,0)","v":100},{"$f":"ROUND(W25+Y25,0)","v":113}]
[null,"Core Subtest T Scores",null,null,null,"Working Memory",null,"Processing Speed",null,"School Readiness",null,null,null,null,null,null,null,null,"Standard Score"]
[null,null,null,"T Score",null,"(Gsm)",null,"(Gs)",null,"(5:0-8:11)",null,"Percentile",null,null,null,null,null,null,null,null,"v v GCA",{"$f":"CHOOSE(btwcl, 11,15,19)","v":15},{"$f":"IF(ABS(verb-gca)>=V27,1,0)","v":0},{"$f":"verb-gca","v":2},{"$f":"IF(W27=0,\"\",IF(X27>0,\"V > GCA\",\"V < GCA\"))","v":""}]
[null,"Recall of Objects-Immediate (Glr)","RObI",{"$f":"IF('Input page Early Years'!D22=\"\",\"\",'Input page Early Years'!D22)","v":52},null,null,null,null,null,null,null,{"$f":"IF(D28=\"\",\"\",LOOKUP(D28,ttopr))","v":58},null,null,null,null,null,null,{"$f":"100+((D28-50)/10)*15","v":103},null,"NV v GCA",{"$f":"CHOOSE(btwcl, 9,12,15)","v":12},{"$f":"IF(ABS(nverb-gca)>=V28,1,0)","v":0},{"$f":"nverb-gca","v":6},{"$f":"IF(W28=0,\"\",IF(X28>0,\"NV > GCA\",\"NV < GCA\"))","v":""}]
[null,"Recall of Objects-Delayed (Glr)","RObD",{"$f":"IF('Input page Early Years'!D23=\"\",\"\",'Input page Early Years'!D23)","v":""},null,null,null,null,null,null,null,"",null,null,null,null,null,null,{"$error":"#VALUE!"},null,"SP v GCA",{"$f":"CHOOSE(btwcl, 9,13,17)","v":13},{"$f":"IF(ABS(sp-gca)>=V29,1,0)","v":1},{"$f":"sp-gca","v":-16},{"$f":"IF(W29=0,\"\",IF(X29>0,\"Sp > GCA\",\"Sp < GCA\"))","v":"Sp < GCA"}]
[null,"Recall of Digits Forward (Gsm)","DigF",{"$f":"IF('Input page Early Years'!D24=\"\",\"\",'Input page Early Years'!D24)","v":50},null,null,null,null,null,null,null,50,null,null,null,null,null,null,100]
[null,"Recognition of Pictures (Gv)","RPic",{"$f":"IF('Input page Early Years'!D25=\"\",\"\",'Input page Early Years'!D25)","v":47},null,null,null,null,null,null,null,38,null,null,null,null,null,null,95.5]
[null,"Early Number Concepts (Gc/Gf)","ENC",{"$f":"IF('Input page Early Years'!D26=\"\",\"\",'Input page Early Years'!D26)","v":48},null,null,null,null,null,{"$f":"IF(D32=\"\",\"\",D32)","v":48},null,42,null,null,null,null,null,null,97,null,null,"enc",{"$f":"J32","v":48},{"$f":"W32-W33","v":-1},{"$f":"IF(X32=0,\"\",IF(X32>0,\"ENC > MLLF\",\"ENC < MLLF\"))","v":"ENC < MLLF"},{"$f":"IF(ABS(X32)>10,Y32,\"\")","v":""}]
[null,"Matching Letter Like Forms (Gv)","MLLF",{"$f":"IF('Input page Early Years'!D27=\"\",\"\",'Input page Early Years'!D27)","v":49},null,null,null,null,null,{"$f":"IF(D33=\"\",\"\",D33)","v":49},null,48,null,null,null,null,null,null,98.5,null,null,"mllf",{"$f":"J33","v":49},{"$f":"W33-W34","v":{"$error":"#VALUE!"}},{"$f":"IF(X33=0,\"\",IF(X33>0,\"MLLF > PhP\",\"MLLF < PhP\"))","v":{"$error":"#VALUE!"}},{"$f":"IF(ABS(X33)>9,Y33,\"\")","v":{"$error":"#VALUE!"}}]
[null,"Recall of Sequential Order (Gsm)","SeqO",{"$f":"IF('Input page Early Years'!D28=\"\",\"\",'Input page Early Years'!D28)","v":""},null,{"$f":"IF(D34=\"\",\"\",D34)","v":""},null,null,null,null,null,"",null,null,null,null,null,null,{"$error":"#VALUE!"},null,null,"php",{"$f":"J37","v":""},{"$f":"W32-W34","v":{"$error":"#VALUE!"}},{"$f":"IF(X34=0,\"\",IF(X34>0,\"ENC > PhP\",\"ENC < PhP\"))","v":{"$error":"#VALUE!"}},{"$f":"IF(ABS(X34)>7,Y34,\"\")","v":{"$error":"#VALUE!"}},{"$f":"Z32&\" \"&Z33&\" \"&Z34","v":{"$error":"#VALUE!"}}]
[null,"Speed of Information Processing (Gs)","SIP",{"$f":"IF('Input page Early Years'!D29=\"\",\"\",'Input page Early Years'!D29)","v":""},null,null,null,{"$f":"IF(D35=\"\",\"\",D35)","v":""},null,null,null,"",null,null,null,null,null,null,{"$error":"#VALUE!"}]
[null,"Recall of Digits Backward (Gsm)","DigB",{"$f":"IF('Input page Early Years'!D30=\"\",\"\",'Input page Early Years'!D30)","v":""},null,{"$f":"IF(D36=\"\",\"\",D36)","v":""},null,null,null,null,null,"",null,null,null,null,null,null,{"$error":"#VALUE!"}]
[null,"Phonological Processing (Ga)","PhP",{"$f":"IF('Input page Early Years'!D31=\"\",\"\",'Input page Early Years'!D31)","v":""},null,null,null,null,null,{"$f":"IF(D37=\"\",\"\",D37)","v":""},null,"",null,null,null,null,null,null,{"$error":"#VALUE!"}]
[null,"Rapid Naming (Gs)","RNam",{"$f":"IF('Input page Early Years'!D32=\"\",\"\",'Input page Early Years'!D32)","v":""},null,null,null,{"$f":"IF(D38=\"\",\"\",D38)","v":""},null,null,null,"",null,null,null,null,null,null,{"$error":"#VALUE!"}]
[null,"Diagnostic Cluster Scores "]
[]
[null,null,null,"Sum of Core T scores",null,{"$f":"V42","v":""},null,{"$f":"V43","v":""},null,{"$f":"V44","v":""},null,null,null,null,null,null,null,null,null,null,null,null,null,{"$f":"gca","v":111},"gca"]
[null,null,null,"Standard Score",null,{"$f":"IF(F41=\"\",\"\",'Input page Early Years'!D35)","v":""},null,{"$f":"IF(H41=\"\",\"\",'Input page Early Years'!D36)","v":""},null,{"$f":"IF(J41=\"\",\"\",'Input page Early Years'!D37)","v":""},null,null,null,null,null,null,null,null,null,null,null,{"$f":"IF(COUNT(F34:F37)<2,\"\",F34+F36)","v":""},null,{"$f":"wm","v":""},"wm",{"$f":"IF(X42=\"\",0,IF(X41=\"\",0,(X42-X41)))","v":0},{"$f":"IF(Z42=0,\"\",IF(Z42>0,\"WM > GCA\",\"WM < GCA\"))","v":""},{"$f":"IF(ABS(Z42)>8,AA42,\"\")","v":""}]
[null,null,null,"Percentile",null,{"$f":"IF(F41=\"\",\"\",LOOKUP(F42,sstopr))","v":""},null,{"$f":"IF(H41=\"\",\"\",LOOKUP(H42,sstopr))","v":""},null,{"$f":"IF(J41=\"\",\"\",LOOKUP(J42,sstopr))","v":""},null,null,null,null,null,null,null,null,null,null,null,{"$f":"IF(COUNT(H35:H38)<2,\"\",H35+H38)","v":""},null,{"$f":"ps","v":""},"ps",{"$f":"IF(X44=\"\",0,IF(X41=\"\",0,(X44-X41)))","v":0},{"$f":"IF(Z43=0,\"\",IF(Z43>0,\"PS > GCA\",\"PS < GCA\"))","v":""},{"$f":"IF(ABS(Z43)>10,AA43,\"\")","v":""}]
[null,null,null,"Confidence Interval",null,{"$f":"IF(F41=\"\",\"\",Z22&\" to \"&AA22)","v":""},null,{"$f":"IF(H41=\"\",\"\",Z23&\" to \"&AA23)","v":""},null,{"$f":"IF(J41=\"\",\"\",Z19&\" to \"&AA19)","v":""},null,null,null,null,null,null,null,null,null,null,null,{"$f":"IF(COUNT(J32:J37)<3,\"\",J32+J33+J37)","v":""},null,{"$f":"sr","v":""},"schr",{"$f":"IF(X44=\"\",0,IF(X41=\"\",0,(X44-X41)))","v":0},{"$f":"IF(Z44=0,\"\",IF(Z44>0,\"SR > GCA\",\"SR < GCA\"))","v":""},{"$f":"IF(ABS(Z44)>8,AA44,\"\")","v":""},{"$f":"IF(X44=\"\",0,IF(X42=\"\",0,(X44-X42)))","v":0},{"$f":"IF(AC44=0,\"\",IF(AC44>0,\"SR < WM\",\"SR > WM\"))","v":""},{"$f":"IF(ABS(AC44)>9,AD44,\"\")","v":""},{"$f":"IF(X44=\"\",0,IF(X43=\"\",0,(X44-X43)))","v":0},{"$f":"IF(AF44=0,\"\",IF(AF44>0,\"SR < PS\",\"SR > PS\"))","v":""},{"$f":"IF(ABS(AF44)>11,AG44,\"\")","v":""},{"$f":"AE44&\"   \"&AH44","v":"   "}]
[null,null,null,"Difference from GCA",null,{"$f":"IF(F41=\"\",\"\",AB42)","v":""},null,{"$f":"IF(H41=\"\",\"\",AB43)","v":""},null,{"$f":"IF(J41=\"\",\"\",AB44)","v":""}]
[null,null,null,"Between Cluster Difference",null,{"$f":"IF(OR(F41=\"\",H41=\"\"),\"\",V64)","v":""},null,null,null,{"$f":"IF(J41=\"\",\"\",AI44)","v":""}]
[null,null,null,"Within Cluster Differences",null,{"$f":"IF(F41=\"\",\"\",V79)","v":""},null,{"$f":"IF(H41=\"\",\"\",V80)","v":""},null,{"$f":"IF(J41=\"\",\"\",AA34)","v":""},null,null,null,null,null,null,null,null,null,null,null,null,null,null,null,null,0,16,19,24,30,37,48,"vvsnv vh"]
[null,null,null,null,null,"Working Memory",null,"Processing Speed",null,"School Readiness",null,null,null,null,null,null,null,null,null,null,null,2,{"$f":"CHOOSE(btwcl,\".15\",\".05\",\".01\")","v":".05"},null,null,null,0,13,18,24,30,35,42,"vvsnv vl"]
[null,null,null,null,null,"(Gsm)",null,"(Gs)",null,"(5:0-8:11)",null,null,null,null,null,null,null,null,null,null,null,null,null,null,null,null,0,15,19,25,30,38,42,"vvssp vh"]
[null,null,null,null,null,null,null,null,null,null,null,null,null,null,null,null,null,null,null,null,null,"Score 1","Score2",null,"<=>",null,0,15,19,23,30,36,44,"vvssp vl"]
[null,null,{"$f":"\"Comparisons at \"&W48&\" level\"","v":"Comparisons at .05 level"},null,null,null,null,"Difference",null,"Significance",null,"Frequency",null,null,null,null,null,null,null,null,"v vs nv",{"$f":"verb","v":113},{"$f":"nverb","v":117},{"$f":"CHOOSE(btwcl,11,15,19)","v":15},{"$f":"IF(V51=W51,2,IF(V51>W51,1,3))","v":3},{"$f":"IF(Y51=2,\"\",IF(Y51=1,LOOKUP(ABS(H52),AA47:AG47,AA65:AG65),LOOKUP(ABS(H52),AA48:AG48,AA65:AG65)))","v":">15"},0,15,19,25,33,38,42,"nvvssp nvh"]
[null,null,null,null,null,{"$f":"IF(V51=W51,\"Verbal (\"&F17&\") = Nonverbal Reasoning (\"&H17&\") \",IF(V51>W51,\"Verbal (\"&F17&\") > Nonverbal Reasoning (\"&H17&\") \",\"Verbal (\"&F17&\") < Nonverbal Reasoning (\"&H17&\") \"))","v":"Verbal (113) < Nonverbal Reasoning (117) "},null,{"$f":"IF(OR(V51=\"\",W51=\"\"),\"\",V51-W51)","v":-4},null,{"$f":"IF(OR(V51=\"\",W51=\"\"),\"\",IF(ABS(H52)>=X51,\"Yes\",\"No\"))","v":"No"},null,{"$f":"IF(OR(V51=\"\",W51=\"\"),\"\",Z51&\"%\")","v":">15%"},null,null,null,null,null,null,null,null,"v vs sp",{"$f":"verb","v":113},{"$f":"sp","v":95},{"$f":"CHOOSE(btwcl,9,12,15)","v":12},1,{"$f":"IF(Y52=2,\"\",IF(Y52=1,LOOKUP(ABS(H53),AA49:AG49,AA65:AG65),LOOKUP(ABS(H53),AA50:AG50,AA65:AG65)))","v":10},0,16,19,24,30,32,35,"nvvssp nvl"]
[null,null,null,null,null,{"$f":"IF(V53=W53,\"Nonverbal  (\"&H17&\")  = Spatial (\"&J17&\")\",IF(V53>W53,\"Nonverbal  (\"&H17&\")> Spatial (\"&J17&\")\",\"Nonverbal  (\"&H17&\") < Spatial (\"&J17&\")\"))","v":"Nonverbal  (117)> Spatial (95)"},null,{"$f":"IF(OR(V53=\"\",W53=\"\"),\"\",V53-W53)","v":22},null,{"$f":"IF(OR(V53=\"\",W53=\"\"),\"\",IF(ABS(H53)>=X53,\"Yes\",\"No\"))","v":"Yes"},null,{"$f":"IF(OR(V53=\"\",W53=\"\"),\"\",Z52&\"%\")","v":"10%"},null,null,null,null,null,null,null,null,"nv vs sp",{"$f":"nverb","v":117},{"$f":"sp","v":95},{"$f":"CHOOSE(btwcl,9,13,17)","v":13},1,{"$f":"IF(Y53=2,\"\",IF(Y53=1,LOOKUP(ABS(H54),AA51:AG51,AA65:AG65),LOOKUP(ABS(H54),AA52:AF52,AA65:AG65)))","v":15},0,18,22,30,38,45,49,"wmvspsp wmh"]
[null,null,null,null,null,{"$f":"IF(V53=W53,\"Verbal (\"&F17&\")= Spatial (\"&J17&\")\",IF(V53>W53,\"Verbal (\"&F17&\")> Spatial (\"&J17&\")\",\"Verbal (\"&F17&\") < Spatial (\"&J17&\")\"))","v":"Verbal (113)> Spatial (95)"},null,{"$f":"IF(OR(V52=\"\",W52=\"\"),\"\",V52-W52)","v":18},null,{"$f":"IF(OR(V52=\"\",W52=\"\"),\"\",IF(ABS(H54)>=X52,\"Yes\",\"No\"))","v":"Yes"},null,{"$f":"IF(OR(V52=\"\",W52=\"\"),\"\",Z53&\"%\")","v":"15%"},null,null,null,null,null,null,null,null,"wm vs ps",{"$f":"F42","v":""},{"$f":"H42","v":""},{"$f":"CHOOSE(btwcl,9,12,15)","v":12},2,{"$f":"IF(Y54=2,\"\",IF(Y54=1,LOOKUP(ABS(H58),AA53:AG53,AA65:AG65),LOOKUP(ABS(H58),AA54:AG54,AA65:AG65)))","v":""},0,16,20,26,34,35,37,"wmvspsp wml"]
[null,null,null,null,null,{"$f":"IF(V51=W51,\"Working Memory (\"&wm&\") = GCA (\"&gca&\") \",IF(V51>W51,\"Working Memory (\"&wm&\") > GCA (\"&gca&\")\",\"Working Memory (\"&wm&\")  < GCA (\"&gca&\")\"))","v":"Working Memory ()  < GCA (111)"},null,{"$f":"IF(OR(V57=\"\",W57=\"\"),\"\",V57-W57)","v":""},null,{"$f":"IF(OR(V57=\"\",W57=\"\"),\"\",IF(ABS(H55)>=X57,\"Yes\",\"No\"))","v":""},null,{"$f":"IF(OR(V57=\"\",W57=\"\"),\"\",Z57&\"%\")","v":""},null,null,null,null,null,null,null,null,"wm vs schr",{"$f":"F42","v":""},{"$f":"J42","v":""},{"$f":"CHOOSE(btwcl,8,10,14)","v":10},2,{"$f":"IF(Y55=2,\"\",IF(Y55=1,LOOKUP(ABS(H59),AA55:AG55,AA65:AG65),LOOKUP(ABS(H59),AA56:AG56,AA65:AG65)))","v":""},0,12,15,19,23,26,36]
[null,null,null,null,null,{"$f":"IF(V52=W52,\"Processing Speed (\"&ps&\") = GCA (\"&gca&\") \",IF(V52>W52,\"Processing Speed (\"&ps&\") < GCA (\"&gca&\")\",\"Processing Speed (\"&ps&\")  > GCA (\"&gca&\")\"))","v":"Processing Speed () < GCA (111)"},null,{"$f":"IF(OR(V58=\"\",W58=\"\"),\"\",V58-W58)","v":""},null,{"$f":"IF(OR(V58=\"\",W58=\"\"),\"\",IF(ABS(H56)>=X58,\"Yes\",\"No\"))","v":""},null,{"$f":"IF(OR(V58=\"\",W58=\"\"),\"\",Z58&\"%\")","v":""},null,null,null,null,null,null,null,null,"sch vs ps",{"$f":"J42","v":""},{"$f":"H42","v":""},{"$f":"CHOOSE(btwcl,9,12,16)","v":12},2,{"$f":"IF(Y56=2,\"\",IF(Y56=1,LOOKUP(ABS(H60),AA60:AG60,AA65:AG65),LOOKUP(ABS(H60),AH60:AN60,AA65:AG65)))","v":""},0,13,17,22,26,29,31]
[null,null,null,null,null,{"$f":"IF(V53=W53,\"School Readiness (\"&sr&\") = GCA (\"&gca&\") \",IF(V53>W53,\"School Readiness (\"&sr&\") > GCA (\"&gca&\")\",\"School Readiness (\"&sr&\")  < GCA (\"&gca&\")\"))","v":"School Readiness () > GCA (111)"},null,{"$f":"IF(OR(V59=\"\",W59=\"\"),\"\",V59-W59)","v":""},null,{"$f":"IF(OR(V59=\"\",W59=\"\"),\"\",IF(ABS(H57)>=X59,\"Yes\",\"No\"))","v":""},null,{"$f":"IF(OR(V59=\"\",W59=\"\"),\"\",Z59&\"%\")","v":""},null,null,null,null,null,null,null,null,"m vs gca",{"$f":"F42","v":""},{"$f":"gca","v":111},{"$f":"CHOOSE(btwcl,7,9,12)","v":9},{"$f":"IF(V57=W57,2,IF(V57>W57,1,3))","v":1},{"$f":"IF(Y57=2,\"\",IF(Y57=1,LOOKUP(ABS(H55),AA57:AG57,AA65:AG65),LOOKUP(ABS(H55),AA57:AG57,AA65:AG65)))","v":{"$error":"#VALUE!"}},0,12,15,20]
[null,null,null,null,null,{"$f":"IF(V54=W54,\"Working Memory (\"&F42&\") = Processing Speed (\"&H42&\") \",IF(V54>W54,\"Working Memory (\"&F42&\") > Processing Speed (\"&H42&\")\",\"Working Memory (\"&F42&\")  < Processing Speed (\"&H42&\")\"))","v":"Working Memory () = Processing Speed () "},null,{"$f":"IF(OR(V54=\"\",W54=\"\"),\"\",V54-W54)","v":""},null,{"$f":"IF(OR(V54=\"\",W54=\"\"),\"\",IF(ABS(H58)>=X54,\"Yes\",\"No\"))","v":""},null,{"$f":"IF(OR(V54=\"\",W54=\"\"),\"\",Z54&\"%\")","v":""},null,null,null,null,null,null,null,null,"ps vs gca",{"$f":"H42","v":""},{"$f":"gca","v":111},{"$f":"CHOOSE(btwcl,8,11,15)","v":11},1,{"$f":"IF(Y58=2,\"\",IF(Y58=1,LOOKUP(ABS(H56),AA58:AG58,AA65:AG65),LOOKUP(ABS(H56),AH58:AN58,AA65:AG65)))","v":{"$error":"#VALUE!"}},0,16,20,28,null,null,null,0,16,20,26]
[null,null,null,null,null,{"$f":"IF(V55=W55,\"Working Memory (\"&F42&\") = School Readiness (\"&J42&\") \",IF(V55>W55,\"Working Memory (\"&F42&\") > School Readiness (\"&J42&\")\",\"Working Memory (\"&F42&\")  < School Readiness (\"&J42&\")\"))","v":"Working Memory () = School Readiness () "},null,{"$f":"IF(OR(V55=\"\",W55=\"\"),\"\",V55-W55)","v":""},null,{"$f":"IF(OR(V55=\"\",W55=\"\"),\"\",IF(ABS(H59)>=X55,\"Yes\",\"No\"))","v":""},null,{"$f":"IF(OR(V55=\"\",W55=\"\"),\"\",Z55&\"%\")","v":""},null,null,null,null,null,null,null,null,"schr vs gca",{"$f":"J42","v":""},{"$f":"gca","v":111},{"$f":"CHOOSE(btwcl,7,9,12)","v":9},1,{"$f":"IF(Y59=2,\"\",IF(Y59=1,LOOKUP(ABS(H57),AA60:AG60,AA65:AG65),LOOKUP(ABS(H57),AH60:AN60,AA65:AG65)))","v":{"$error":"#VALUE!"}},0,11,14,18,22,27,30,0,11,14,17,22,23,25]
[null,null,null,null,null,{"$f":"IF(V56=W56,\"School Readiness (\"&J42&\") = Processing Speed (\"&H42&\") \",IF(V56>W56,\"School Readiness (\"&J42&\") > Processing Speed (\"&H42&\")\",\"School Readiness (\"&J42&\")  < Processing Speed (\"&H42&\")\"))","v":"School Readiness () = Processing Speed () "},null,{"$f":"IF(OR(V56=\"\",W56=\"\"),\"\",V56-W56)","v":""},null,{"$f":"IF(OR(V56=\"\",W56=\"\"),\"\",IF(ABS(H60)>=X56,\"Yes\",\"No\"))","v":""},null,{"$f":"IF(OR(V56=\"\",W56=\"\"),\"\",Z56&\"%\")","v":""},null,null,null,null,null,null,null,null,null,null,null,null,null,null,0,17,20,27,36,38,42,0,16,20,26,29,33,39]
[null,null,null,null,null,null,null,null,null,null,null,null,null,null,null,null,null,null,null,null,null,{"$f":"IF(J52=\"No\",\"\",IF(V51=W51,\"\",IF(V51>W51,\"V > NVR\",\"V< NVR\")))","v":""},null,null,null,null,0,12,15,19,23,26,36,"srvswm srh"]
[null,null,null,{"$f":"\"Verbal (\"&V51&\")      \"","v":"Verbal (113)      "},null,{"$f":"IF(OR(V66=\"\",W66=\"\"),\"\",X77)","v":""},null,null,null,null,null,null,null,null,null,null,null,null,null,null,null,{"$f":"IF(J54=\"No\",\"\",IF(V52=W52,\"\",IF(V52>W52,\"V > Sp\",\"V< Sp\")))","v":"V > Sp"},null,null,null,null,0,13,17,22,26,29,31,"srvswm srl"]
[null,null,null,null,null,{"$f":"IF(V48=X48,\"Verbal Comprehension (\"&F8&\") = Naming Vocabulary (\"&F10&\") \",IF(V48>X48,\"Verbal Comprehension (\"&F8&\") > Naming Vocabulary (\"&F10&\")\",\"Verbal Comprehension (\"&F8&\")  < Naming Vocabulary (\"&F10&\")\"))","v":"Verbal Comprehension (53) > Naming Vocabulary (62)"},null,{"$f":"IF(OR(V66=\"\",W66=\"\"),\"\",V66-W66)","v":-9},null,{"$f":"IF(OR(V66=\"\",W66=\"\"),\"\",IF(ABS(H63)>=X66,\"Yes\",\"No\"))","v":"No"},null,{"$f":"IF(OR(V66=\"\",W66=\"\"),\"\",Z66&\"%\")","v":"15%"},null,null,null,null,null,null,null,null,null,{"$f":"IF(J53=\"No\",\"\",IF(V53=W53,\"\",IF(V53>W53,\"NVR > Sp\",\"NVR < Sp\")))","v":"NVR > Sp"},null,null,null,null,0,17,20,27,36,38,42,"srvsphp srh"]
[null,null,null,{"$f":"\"Nonverbal Reasoning (\"&W51&\")      \"","v":"Nonverbal Reasoning (117)      "},null,{"$f":"IF(OR(V67=\"\",W67=\"\"),\"\",X78)","v":""},null,null,null,null,null,null,null,null,null,null,null,null,null,null,{"$f":"IF(V67=V68,\"Picture Similarities (\"&H9&\") = Pattern Construction (\"&V68&\") \",IF(V67>V68,\"Picture Similarities (\"&H9&\") > Pattern Construction (\"&V68&\")\",\"Picture Similarities (\"&H9&\")  < Pattern Construction (\"&V68&\")\"))","v":"Picture Similarities (56) > Pattern Construction (46)"},{"$f":"IF(J58=\"No\",\"\",IF(V54=W54,\"\",IF(V54>W54,\"WM > PS\",\"WM < PS\")))","v":""},null,null,null,null,0,16,20,26,29,33,39,"srvsphp srl"]
[null,null,null,null,null,{"$f":"IF('Input page Early Years'!T9=1,U64,U65)","v":"Picture Similarities (56)  < Matrices (63)"},null,{"$f":"IF(OR(V67=\"\",W67=\"\"),\"\",V67-W67)","v":-7},null,{"$f":"IF(OR(V67=\"\",W67=\"\"),\"\",IF(ABS(H65)>=X67,\"Yes\",\"No\"))","v":"No"},null,{"$f":"IF(OR(V67=\"\",W67=\"\"),\"\",Z67&\"%\")","v":">15%"},null,null,null,null,null,null,null,null,{"$f":"IF(V67=W67,\"Picture Similarities (\"&H9&\") = Matrices (\"&W67&\") \",IF(V67>W67,\"Picture Similarities (\"&H9&\") > Matrices (\"&W67&\")\",\"Picture Similarities (\"&H9&\")  < Matrices (\"&W67&\")\"))","v":"Picture Similarities (56)  < Matrices (63)"},null,null,null,null,null,">15",15,10,5,2,1,0.5]
[null,null,null,{"$f":"IF('Input page Early Years'!T9=1,\"\",\"Spatial (\"&W52&\")      \")","v":"Spatial (95)      "},null,{"$f":"IF(OR(V68=\"\",W68=\"\"),\"\",X79)","v":""},null,null,null,null,null,null,null,null,null,null,null,null,null,null,"vc vs nv",{"$f":"F8","v":53},{"$f":"F10","v":62},{"$f":"CHOOSE(btwcl,8,11,15)","v":11},{"$f":"IF(V66=W66,2,IF(V66>W66,1,3))","v":3},{"$f":"IF(Y66=2,\"\",IF(Y66=1,LOOKUP(ABS(H63),AA66:AE66,AA82:AE82),LOOKUP(ABS(H63),AA67:AE67,AA82:AE82)))","v":15},0,8,10,13,19,"wd>S"]
[null,null,null,null,null,{"$f":"IF('Input page Early Years'!T9=1,\"\",IF(V68=W68,\"Pattern Construction (\"&V68&\") = Copying (\"&W68&\") \",IF(V68>W68,\"Pattern Construction (\"&V68&\") > Copying (\"&W68&\")\",\"Pattern Construction (\"&V68&\")  < Copying (\"&W68&\")\")))","v":"Pattern Construction (46)  < Copying (49)"},null,{"$f":"IF(OR(V68=\"\",W68=\"\"),\"\",V68-W68)","v":-3},null,{"$f":"IF(OR(V68=\"\",W68=\"\"),\"\",IF(ABS(H67)>=X68,\"Yes\",\"No\"))","v":"No"},null,{"$f":"IF(OR(V68=\"\",W68=\"\"),\"\",Z68&\"%\")","v":">15%"},null,null,null,null,null,null,null,null,{"$f":"IF('Input page Early Years'!T9=1,\"psim vs pc\",\"psim vs mat\")","v":"psim vs mat"},{"$f":"H9","v":56},{"$f":"IF('Input page Early Years'!T9=1,IF(H11=0,\"\",H11),IF(H12=0,\"\",H12))","v":63},{"$f":"CHOOSE(btwcl,9,12,16)","v":12},{"$f":"IF(V67=W67,2,IF(V67>W67,1,3))","v":3},{"$f":"IF(Y67=2,\"\",IF(Y67=1,LOOKUP(ABS(H65),AA68:AE68,AA82:AE82),LOOKUP(ABS(H65),AA69:AE69,AA82:AE82)))","v":">15"},0,9,12,15,17,"Wd<s"]
[null,null,null,{"$f":"\"Working Memory (\"&V54&\")      \"","v":"Working Memory ()      "},null,{"$f":"IF(OR(V69=\"\",W69=\"\"),\"\",X80)","v":""},null,null,null,null,null,null,null,null,null,null,null,null,null,null,"pc vs copy",{"$f":"IF('Input page Early Years'!T9=1,H11,J11)","v":46},{"$f":"IF(J13=0,\"\",J13)","v":49},{"$f":"CHOOSE(btwcl,6,8,10)","v":8},3,{"$f":"IF(Y68=2,\"\",IF(Y68=1,LOOKUP(ABS(H67),AA70:AE70,AA82:AE82),LOOKUP(ABS(H67),AA77:AE77,AA82:AE82)))","v":">15"},0,{"$f":"IF('Input page Early Years'!T9=1,12,11)","v":11},{"$f":"IF('Input page Early Years'!T9=1,15,14)","v":14},18,{"$f":"IF('Input page Early Years'!T9=1,23,24)","v":24},"m>sq"]
[null,null,null,null,null,{"$f":"IF(V69=W69,\"Recall of Sequential Order (\"&F34&\") = Recall of Digits Backward (\"&F36&\") \",IF(V69>W69,\"Recall of Sequential Order (\"&F34&\") > Recall of Digits Backward (\"&F36&\")\",\"Recall of Sequential Order (\"&F34&\")  < Recall of Digits Backward (\"&F36&\")\"))","v":"Recall of Sequential Order () = Recall of Digits Backward () "},null,{"$f":"IF(OR(V69=\"\",W69=\"\"),\"\",V69-W69)","v":""},null,{"$f":"IF(OR(V69=\"\",W69=\"\"),\"\",IF(ABS(H69)>=X69,\"Yes\",\"No\"))","v":""},null,{"$f":"IF(OR(V69=\"\",W69=\"\"),\"\",Z69&\"%\")","v":""},null,null,null,null,null,null,null,null,"rso vs rdb",{"$f":"F34","v":""},{"$f":"F36","v":""},{"$f":"CHOOSE(btwcl,7,9,12)","v":9},2,{"$f":"IF(Y69=2,\"\",IF(Y69=1,LOOKUP(ABS(H69),AA78:AE78,AA82:AE82),LOOKUP(ABS(H69),AA79:AE79,AA82:AE82)))","v":""},0,{"$f":"IF('Input page Early Years'!T9=1,8,12)","v":12},{"$f":"IF('Input page Early Years'!T9=1,12,14)","v":14},{"$f":"IF('Input page Early Years'!T9=1,14,18)","v":18},{"$f":"IF('Input page Early Years'!T9=1,20,22)","v":22},"M<sq"]
[null,null,null,{"$f":"\"Processing Speed (\"&W54&\")      \"","v":"Processing Speed ()      "},null,{"$f":"IF(OR(V70=\"\",W70=\"\"),\"\",X81)","v":""},null,null,null,null,null,null,null,null,null,null,null,null,null,null,"sip vs rn",{"$f":"H35","v":""},{"$f":"H38","v":""},{"$f":"CHOOSE(btwcl,8,11,14)","v":11},2,{"$f":"IF(Y70=2,\"\",IF(Y70=1,LOOKUP(ABS(I71),AA80:AE80,AA82:AE82),LOOKUP(ABS(I71),AA81:AE81,AA82:AE82)))","v":""},0,9,12,16,23,"rdes>pc"]
[null,null,null,null,null,{"$f":"IF(V70=W70,\"Speed of Information Processing (\"&H35&\") = Rapid Naming (\"&H38&\") \",IF(V70>W70,\"Speed of Information Processing (\"&H35&\") > Rapid Naming (\"&H38&\")\",\"Speed of Information Processing (\"&H35&\")  < Rapid Naming (\"&H38&\")\"))","v":"Speed of Information Processing () = Rapid Naming () "},null,{"$f":"IF(OR(V70=\"\",W70=\"\"),\"\",V70-W70)","v":""},{"$f":"V70-W70","v":{"$error":"#VALUE!"}},{"$f":"IF(OR(V70=\"\",W70=\"\"),\"\",IF(ABS(I71)>=X70,\"Yes\",\"No\"))","v":""},null,{"$f":"IF(OR(V70=\"\",W70=\"\"),\"\",Z70&\"%\")","v":""},null,null,null,null,null,null,null,null,"enc vs mllf",{"$f":"J32","v":48},{"$f":"J33","v":49},{"$f":"CHOOSE(btwcl,8,11,14)","v":11},{"$f":"IF(V71=W71,2,IF(V71>W71,1,3))","v":3},{"$f":"IF(Y71=2,\"\",IF(Y71=1,LOOKUP(ABS(H73),AA71:AE71,AA82:AE82),LOOKUP(ABS(H73),AA72:AE72,AA82:AE82)))","v":">15"},0,11,14,19,25]
[null,null,null,{"$f":"\"School Readiness (\"&V56&\")      \"","v":"School Readiness ()      "},null,{"$f":"IF(OR(V72=\"\",W72=\"\"),\"\",X83)","v":""},null,null,null,null,null,null,null,null,null,null,null,null,null,null,"enc vs Php",{"$f":"J32","v":48},{"$f":"J37","v":""},{"$f":"CHOOSE(btwcl,8,11,14)","v":11},3,{"$f":"IF(Y72=2,\"\",IF(Y72=1,LOOKUP(ABS(I74),AA73:AE73,AA82:AE82),LOOKUP(ABS(I74),AA74:AE74,AA82:AE82)))","v":{"$error":"#VALUE!"}},0,11,13,18,23]
[null,null,null,null,null,{"$f":"IF(V71=W71,\"Early Number Concepts (\"&J32&\") = Matching Letter-like Forms (\"&J33&\") \",IF(V71>W71,\"Early Number Concepts (\"&J32&\") > Matching Letter-like Forms (\"&J33&\")\",\"Early Number Concepts (\"&J32&\")  < Matching Letter-like Forms (\"&J33&\")\"))","v":"Early Number Concepts (48)  < Matching Letter-like Forms (49)"},null,{"$f":"IF(OR(V71=\"\",W71=\"\"),\"\",V71-W71)","v":-1},{"$f":"V72-W72","v":{"$error":"#VALUE!"}},{"$f":"IF(OR(V72=\"\",W72=\"\"),\"\",IF(ABS(I73)>=X72,\"Yes\",\"No\"))","v":""},null,{"$f":"IF(OR(V71=\"\",W71=\"\"),\"\",IF(H73=0,\"\",Z71&\"%\"))","v":">15%"},null,null,null,null,null,null,null,null,"mllf vs Php",{"$f":"J33","v":49},{"$f":"J37","v":""},{"$f":"CHOOSE(btwcl,8,11,14)","v":11},3,{"$f":"IF(Y73=2,\"\",IF(Y73=1,LOOKUP(ABS(I75),AA75:AE75,AA82:AE82),LOOKUP(ABS(I75),AA76:AE76:AE73AA79:AA82:AE82)))","v":{"$error":"#VALUE!"}},0,11,14,19,24]
[null,null,null,null,null,{"$f":"IF(V72=W72,\"Early Number Concepts (\"&J32&\") = Phonological Processing (\"&J37&\") \",IF(V72>W72,\"Early Number Concepts (\"&J32&\") > Phonological Processing (\"&J37&\")\",\"Early Number Concepts (\"&J32&\")  < Phonological Processing (\"&J37&\")\"))","v":"Early Number Concepts (48)  < Phonological Processing ()"},null,{"$f":"IF(OR(V72=\"\",W72=\"\"),\"\",V72-W72)","v":""},{"$f":"V72-W72","v":{"$error":"#VALUE!"}},{"$f":"IF(OR(V73=\"\",W73=\"\"),\"\",IF(ABS(I74)>=X73,\"Yes\",\"No\"))","v":""},null,{"$f":"IF(OR(V72=\"\",W72=\"\"),\"\",IF(H74=0,\"\",Z72&\"%\"))","v":""},null,null,null,null,null,null,null,null,null,null,null,null,null,null,0,9,11,14,18]
[null,null,null,null,null,{"$f":"IF(V73=W73,\"Matching Letter-like Forms (\"&J33&\") = Phonological Processing (\"&J37&\") \",IF(V73>W73,\"Matching Letter-like Forms (\"&J33&\") > Phonological Processing (\"&J37&\")\",\"Matching Letter-like Forms  (\"&J33&\")  < Phonological Processing (\"&J37&\")\"))","v":"Matching Letter-like Forms  (49)  < Phonological Processing ()"},null,{"$f":"IF(OR(V73=\"\",W73=\"\"),\"\",V73-W73)","v":""},{"$f":"V73-W73","v":{"$error":"#VALUE!"}},{"$f":"IF(OR(V73=\"\",W73=\"\"),\"\",IF(ABS(I75)>=X73,\"Yes\",\"No\"))","v":""},null,{"$f":"IF(OR(V73=\"\",W73=\"\"),\"\",IF(H75=0,\"\",Z73&\"%\"))","v":""},null,null,null,null,null,null,null,null,null,null,null,null,null,null,0,14,17,23,27]
[null,null,null,null,null,null,null,null,null,null,null,null,null,null,null,null,null,null,null,null,null,{"$f":"IF(J63=\"No\",\"\",IF(V66=W66,\"\",IF(V66>W66,\"VC > NV\",\"VC< NV\")))","v":""},null,null,null,null,0,9,12,16,20]
[null,null,null,null,null,null,null,null,null,null,null,null,null,null,null,null,null,null,null,null,null,{"$f":"IF(J65=\"No\",\"\",IF(V67=W67,\"\",IF(V67>W67,\"PSim > Mat\",\"PSim < Mat\")))","v":""},{"$f":"IF(J65=\"No\",\"\",IF(V67=W67,\"\",IF(V67>W67,\"PSim > PC\",\"PSim < PC\")))","v":""},{"$f":"IF(J63=\"No\",\"\",\"Interpret With Caution\")","v":""},null,null,0,9,12,15,21,"Rdes<pc"]
[null,null,null,null,null,null,null,null,null,null,null,null,null,null,null,null,null,null,null,null,null,{"$f":"IF(J67=\"No\",\"\",IF(J67=\"No\",\"\",IF(V68=W68,\"\",IF(V68>W68,\"PC > Copy\",\"PC < Copy\"))))","v":""},null,{"$f":"IF(J65=\"No\",\"\",\"Interpret With Caution\")","v":""},null,null,0,11,14,18,22,"rso>db"]
[null,null,null,null,null,{"$f":"V85","v":55},null,"Difference required",null,null,null,null,null,null,null,null,null,null,null,null,null,{"$f":"IF(J69=\"No\",\"\",IF(J69=\"No\",\"\",IF(V69=W69,\"\",IF(V69>W69,\"RSO > DB\",\"RSO < DB\"))))","v":""},null,{"$f":"IF(J67=\"No\",\"\",\"Interpret With Caution\")","v":""},null,null,0,10,11,16,22,"rso<db"]
[null,null,null,null,null,"T Score",null,null,null,"Difference",null,"Significance",null,"Frequency",null,null,null,null,null,null,null,{"$f":"IF(J71=\"No\",\"\",IF(J71=\"No\",\"\",IF(V70=W70,\"\",IF(V70>W70,\"SIP > RN\",\"SIP < RN\"))))","v":""},null,{"$f":"IF(J69=\"No\",\"\",\"Interpret With Caution\")","v":"Interpret With Caution"},null,null,0,11,14,17,24,"sip>rn"]
[null,null,null,null,{"$f":"B8","v":"Verbal Comprehension (Gc)"},{"$f":"D8","v":53},null,{"$f":"X86","v":8},null,{"$f":"IF(OR(F81=\"\",F79=\"\"),\"\",U85-V85)","v":-2},null,{"$f":"IF(OR(F81=\"\",F79=\"\"),\"\",Z85)","v":""},null,{"$f":"IF(L81=\"\",\"\",IF(meant=1,AB85&\"%\",AC85&\"%\"))","v":""},null,null,null,null,null,null,null,null,null,{"$f":"IF(J71=\"No\",\"\",\"Interpret With Caution\")","v":"Interpret With Caution"},null,null,0,11,13,17,22,"sip<rn"]
[null,null,null,null,{"$f":"B10","v":"Naming Vocabulary (Gc)"},{"$f":"D10","v":62},null,{"$f":"X89","v":6},null,{"$f":"IF(OR(F82=\"\",F79=\"\"),\"\",U86-V86)","v":7},null,{"$f":"IF(OR(F82=\"\",F79=\"\"),\"\",Z86)","v":""},null,"",null,null,null,null,null,null,null,null,null,{"$f":"IF(J72=\"No\",\"\",\"Interpret With Caution\")","v":"Interpret With Caution"},null,null,">15",15,10,5,"<5"]
[null,null,null,null,{"$f":"B9","v":"Picture Similarities (Gf)"},{"$f":"D9","v":56},null,{"$f":"X88","v":8},null,{"$f":"IF(OR(F83=\"\",F79=\"\"),\"\",U87-V87)","v":1},null,{"$f":"IF(OR(F83=\"\",F79=\"\"),\"\",Z87)","v":""},null,"",null,null,null,null,null,null,null,{"$f":"IF(meant=1,\"GCA\",\"SNC\")","v":"GCA"},null,{"$f":"IF(J73=\"No\",\"\",IF(J74=\"No\",\"\",IF(J75=\"No\",\"\",\"Interpret With Caution\")))","v":"Interpret With Caution"}]
[null,null,null,null,{"$f":"B12","v":"Matrices (Gf)"},{"$f":"D12","v":63},null,{"$f":"X90","v":7},null,{"$f":"IF(OR(F84=\"\",F79=\"\"),\"\",U88-V88)","v":8},null,{"$f":"IF(OR(F84=\"\",F79=\"\"),\"\",Z88)","v":"High"},null,"15%",null,null,null,null,null,null,1,"m t","diff","cv","<=>","sig","<=>","gca","snc"]
[null,null,null,null,{"$f":"B11","v":"Pattern Construction (Gv)"},{"$f":"D11","v":46},null,{"$f":"X85","v":7},null,{"$f":"IF(OR(F85=\"\",F79=\"\"),\"\",U89-V89)","v":-9},null,{"$f":"IF(OR(F85=\"\",F79=\"\"),\"\",Z89)","v":"Low"},null,"15%",null,null,null,null,null,{"$f":"E81","v":"Verbal Comprehension (Gc)"},{"$f":"F81","v":53},{"$f":"IF(meant=1,$L$22,$N$22)","v":55},{"$f":"IF(OR(U85=\"\",V85=\"\"),\"\",ABS(U85-V85))","v":2},{"$f":"IF(AND(btwcl=1,meant=1),5,IF(AND(btwcl=2,meant=1),7,IF(AND(btwcl=3,meant=1),10,IF(AND(btwcl=1,meant=2),7,IF(AND(btwcl=2,meant=2),10,IF(AND(btwcl=3,meant=2),13))))))","v":7},{"$f":"IF(U85=V85,\"\",IF(U85>V85,\"High\",\"Low\"))","v":"Low"},{"$f":"IF(W85>=X85,Y85,\"\")","v":""},{"$f":"IF(U85<V85,3,IF(U85>V85,1,2))","v":3},{"$f":"IF(AA85=1,LOOKUP(W85,AD85:AG85,$AD$119:$AG$119),LOOKUP(W85,AD86:AG86,$AD$119:$AG$119))","v":">15"},{"$f":"IF(AB85=3,LOOKUP(W85,AH85:AK85,$AD$119:$AG$119),LOOKUP(W85,AH86:AK86,$AD$119:$AG$119))","v":">15"},0,5,8,9,0,7,10,11,{"$f":"E81","v":"Verbal Comprehension (Gc)"}]
[null,null,null,null,{"$f":"B13","v":"Copying (Gv)"},{"$f":"D13","v":49},null,{"$f":"X87","v":7},null,{"$f":"IF(OR(F86=\"\",F79=\"\"),\"\",U90-V90)","v":-6},null,{"$f":"IF(OR(F86=\"\",F79=\"\"),\"\",Z90)","v":""},null,"",null,null,null,null,null,{"$f":"E82","v":"Naming Vocabulary (Gc)"},62,55,7,{"$f":"IF(AND(btwcl=1,meant=1),6,IF(AND(btwcl=2,meant=1),8,IF(AND(btwcl=3,meant=1),10,IF(AND(btwcl=1,meant=2),8,IF(AND(btwcl=2,meant=2),10,IF(AND(btwcl=3,meant=2),14))))))","v":8},"High","",1,{"$f":"IF(AA86=1,LOOKUP(W86,AD87:AG87,$AD$119:$AG$119),LOOKUP(W86,AD88:AG88,$AD$119:$AG$119))","v":10},{"$f":"IF(AB86=3,LOOKUP(W86,AH87:AK87,$AD$119:$AG$119),LOOKUP(W86,AH88:AK88,$AD$119:$AG$119))","v":15},0,6,8,9,0,8,10,11]
[null,null,null,null,null,null,null,null,null,null,null,null,null,null,null,null,null,null,null,"Picture Similarities (Gf)",56,55,1,{"$f":"IF(AND(btwcl=1,meant=1),5,IF(AND(btwcl=2,meant=1),7,IF(AND(btwcl=3,meant=1),10,IF(AND(btwcl=1,meant=2),5,IF(AND(btwcl=2,meant=2),7,IF(AND(btwcl=3,meant=2),9))))))","v":7},"High","",1,{"$f":"IF(AA87=1,LOOKUP(W87,AD89:AG89,$AD$119:$AG$119),LOOKUP(W87,AD90:AG90,$AD$119:$AG$119))","v":">15"},{"$f":"IF(AB87=3,LOOKUP(W87,AH89:AK89,$AD$119:$AG$119),LOOKUP(W87,AH90:AK90,$AD$119:$AG$119))","v":">15"},0,6,7,8,0,6,7,8,{"$f":"E83","v":"Picture Similarities (Gf)"}]
[null,null,null,null,{"$f":"B28","v":"Recall of Objects-Immediate (Glr)"},{"$f":"D28","v":52},null,{"$f":"X94","v":11},null,{"$f":"IF(OR(F88=\"\",F79=\"\"),\"\",U92-V92)","v":-3},null,{"$f":"IF(OR(F88=\"\",F79=\"\"),\"\",Z92)","v":""},null,{"$f":"IF(L88=\"\",\"\",IF(meant=1,AB94&\"%\",AC94&\"%\"))","v":""},null,null,null,null,null,"Matrices (Gf)",63,55,8,{"$f":"IF(AND(btwcl=1,meant=1),6,IF(AND(btwcl=2,meant=1),8,IF(AND(btwcl=3,meant=1),10,IF(AND(btwcl=1,meant=2),5,IF(AND(btwcl=2,meant=2),7,IF(AND(btwcl=3,meant=2),9))))))","v":8},"High","High",1,{"$f":"IF(AA88=1,LOOKUP(W88,AD91:AG91,$AD$119:$AG$119),LOOKUP(W88,AD94:AG94,$AD$119:$AG$119))","v":15},{"$f":"IF(AB88=13,LOOKUP(W88,AH91:AK91,$AD$119:$AG$119),LOOKUP(W88,AH94:AK94,$AD$119:$AG$119))","v":10},0,7,9,10,0,7,9,10]
[null,null,null,null,"Recall of Objects-Delayed (Glr)","",null,null,null,null,null,{"$f":"IF(F89=\"\",\"\",Z95)","v":""},null,null,null,null,null,null,null,"Pattern Construction (Gv)",46,55,9,{"$f":"IF(AND(btwcl=1,meant=1),4,IF(AND(btwcl=2,meant=1),6,IF(AND(btwcl=3,meant=1),8,IF(AND(btwcl=1,meant=2),5,IF(AND(btwcl=2,meant=2),6,IF(AND(btwcl=3,meant=2),8))))))","v":6},"Low","Low",3,{"$f":"IF(AA89=1,LOOKUP(W89,AD95:AG95,$AD$119:$AG$119),LOOKUP(W89,AD96:AG96,$AD$119:$AG$119))","v":15},{"$f":"IF(AB89=3,LOOKUP(W89,AH95:AK95,$AD$119:$AG$119),LOOKUP(W89,AH96:AK96,$AD$119:$AG$119))","v":10},0,7,9,10,0,9,12,13,{"$f":"E82","v":"Naming Vocabulary (Gc)"}]
[null,null,null,null,"Recall of Digits Forward (Gsm)",50,null,{"$f":"X96","v":8},null,{"$f":"IF(OR(F90=\"\",F79=\"\"),\"\",U94-V94)","v":-5},null,{"$f":"IF(OR(F90=\"\",F79=\"\"),\"\",Z94)","v":""},null,{"$f":"IF(L90=\"\",\"\",IF(meant=1,AB96&\"%\",AC96&\"%\"))","v":""},null,null,null,null,null,"Copying (Gv)",49,55,6,{"$f":"IF(AND(btwcl=1,meant=1),5,IF(AND(btwcl=2,meant=1),7,IF(AND(btwcl=3,meant=1),9,IF(AND(btwcl=1,meant=2),5,IF(AND(btwcl=2,meant=2),6,IF(AND(btwcl=3,meant=2),8))))))","v":7},"Low","",3,{"$f":"IF(AA90=1,LOOKUP(W90,AD97:AG97,$AD$119:$AG$119),LOOKUP(W90,AD98:AG98,$AD$119:$AG$119))","v":">15"},{"$f":"IF(AB90=3,LOOKUP(W90,AH97:AK97,$AD$119:$AG$119),LOOKUP(W90,AH98:AK98,$AD$119:$AG$119))","v":">15"},0,7,8,9,0,9,11,12]
[null,null,null,null,"Recognition of Pictures (Gv)",47,null,{"$f":"X97","v":10},null,{"$f":"IF(OR(F91=\"\",F79=\"\"),\"\",U97-V97)","v":-6},null,{"$f":"IF(OR(F91=\"\",F79=\"\"),\"\",Z97)","v":""},null,{"$f":"IF(L91=\"\",\"\",IF(meant=1,AB97&\"%\",AC97&\"%\"))","v":""},null,null,null,null,null,0,null,null,"",null,null,null,null,null,null,0,7,9,10,0,6,8,9,{"$f":"E85","v":"Pattern Construction (Gv)"}]
[null,null,null,null,"Early Number Concepts (Gc/Gf)",48,null,{"$f":"X92","v":9},null,{"$f":"IF(OR(F92=\"\",F79=\"\"),\"\",U96-V96)","v":-7},null,{"$f":"IF(OR(F92=\"\",F79=\"\"),\"\",Z96)","v":""},null,{"$f":"IF(L92=\"\",\"\",IF(meant=1,AB98&\"%\",AC98&\"%\"))","v":""},null,null,null,null,null,"Recall of Objects-Immediate (Glr)",{"$f":"F88","v":52},{"$f":"IF(meant=1,$L$22,$N$22)","v":55},3,{"$f":"IF(AND(btwcl=1,meant=1),7,IF(AND(btwcl=2,meant=1),9,IF(AND(btwcl=3,meant=1),12,IF(AND(btwcl=1,meant=2),7,IF(AND(btwcl=2,meant=2),9,IF(AND(btwcl=3,meant=2),12))))))","v":9},{"$f":"IF(U92=V92,\"\",IF(U92>V92,\"High\",\"Low\"))","v":"Low"},{"$f":"IF(W92>=X92,Y92,\"\")","v":""},{"$f":"IF(U92<V92,3,IF(U92>V92,1,2))","v":3},{"$f":"IF(AA92=1,LOOKUP(W92,AD115:AG115,$AD$119:$AG$119),LOOKUP(W92,AD116:AG116,$AD$119:$AG$119))","v":">15"},{"$f":"IF(AB92=3,LOOKUP(W92,AH115:AK115,$AH$119:$AK$119),LOOKUP(W92,AH116:AK116,$AH$119:$AK$119))","v":">15"}]
[null,null,null,null,"Matching Letter Like Forms (Gv)",49,null,{"$f":"X93","v":9},null,{"$f":"IF(OR(F93=\"\",F79=\"\"),\"\",U97-V97)","v":-6},null,{"$f":"IF(OR(F93=\"\",F79=\"\"),\"\",Z97)","v":""},null,{"$f":"IF(L93=\"\",\"\",IF(meant=1,AB99&\"%\",AC99&\"%\"))","v":""},null,null,null,null,null,"Recall of Objects-Delayed (Glr)",{"$f":"F89","v":""},{"$f":"IF(meant=1,$L$22,$N$22)","v":55},"",{"$f":"IF(AND(btwcl=1,meant=1),7,IF(AND(btwcl=2,meant=1),9,IF(AND(btwcl=3,meant=1),12,IF(AND(btwcl=1,meant=2),7,IF(AND(btwcl=2,meant=2),10,IF(AND(btwcl=3,meant=2),13))))))","v":9},{"$f":"IF(U93=V93,\"\",IF(U93>V93,\"High\",\"Low\"))","v":"High"},"High",1,{"$f":"IF(AA93=1,LOOKUP(W93,AD117:AG117,$AD$119:$AG$119),LOOKUP(W93,AD118:AG118,$AD$119:$AG$119))","v":{"$error":"#N/A"}},{"$f":"IF(AB93=3,LOOKUP(W93,AH117:AK117,$AH$119:$AK$119),LOOKUP(W93,AH118:AK118,$AH$119:$AK$119))","v":{"$error":"#N/A"}}]
[null,null,null,null,{"$f":"B37","v":"Phonological Processing (Ga)"},{"$f":"D37","v":""},null,{"$f":"X101","v":7},null,{"$f":"IF(OR(F94=\"\",F79=\"\"),\"\",U98-V98)","v":""},null,{"$f":"IF(OR(F94=\"\",F79=\"\"),\"\",Z98)","v":""},null,{"$f":"IF(L94=\"\",\"\",IF(meant=1,AB101&\"%\",AC101&\"%\"))","v":""},null,null,null,null,null,"Recall of Digits Forward (Gsm)",50,{"$f":"IF(meant=1,$L$22,$N$22)","v":55},5,{"$f":"IF(AND(btwcl=1,meant=1),8,IF(AND(btwcl=2,meant=1),11,IF(AND(btwcl=3,meant=1),14,IF(AND(btwcl=1,meant=2),8,IF(AND(btwcl=2,meant=2),11,IF(AND(btwcl=3,meant=2),14))))))","v":11},{"$f":"IF(U94=V94,\"\",IF(U94>V94,\"High\",\"Low\"))","v":"Low"},"",3,{"$f":"IF(AA94=1,LOOKUP(W94,AD99:AG99,$AD$119:$AG$119),LOOKUP(W94,AD100:AG100,$AD$119:$AG$119))","v":">15"},{"$f":"IF(AB94=3,LOOKUP(W94,AH99:AK99,$AD$119:$AG$119),LOOKUP(W94,AH100:AK100,$AD$119:$AG$119))","v":">15"},0,7,9,10,0,7,8,9]
[null,null,null,null,{"$f":"B34","v":"Recall of Sequential Order (Gsm)"},{"$f":"D34","v":""},null,{"$f":"X98","v":8},null,{"$f":"IF(OR(F95=\"\",F79=\"\"),\"\",U99-V99)","v":""},null,{"$f":"IF(OR(F95=\"\",F79=\"\"),\"\",Z99)","v":""},null,{"$f":"IF(L95=\"\",\"\",IF(meant=1,AB98&\"%\",AC98&\"%\"))","v":""},null,null,null,null,null,"Recognition of Pictures (Gv)",47,{"$f":"IF(meant=1,$L$22,$N$22)","v":55},{"$f":"ABS(U95-V95)","v":8},11,{"$f":"IF(U95=V95,\"\",IF(U95>V95,\"RObI < RObD\",\"RobI > RobD\"))","v":"RobI > RobD"},"",3,{"$f":"IF(AA95=1,LOOKUP(W95,AD95:AG95,$AD$119:$AG$119),LOOKUP(W95,AD96:AG96,$AD$119:$AG$119))","v":15},{"$f":"IF(AA95=1,LOOKUP(W95,AH95:AK95,$AD$119:$AG$119),LOOKUP(W95,AH96:AK96,$AD$119:$AG$119))","v":15},0,8,10,11,0,8,10,11,{"$f":"E84","v":"Matrices (Gf)"}]
[null,null,null,null,{"$f":"B36","v":"Recall of Digits Backward (Gsm)"},{"$f":"D36","v":""},null,{"$f":"X100","v":9},null,{"$f":"IF(OR(F96=\"\",F79=\"\"),\"\",U100-V100)","v":""},null,{"$f":"IF(OR(F96=\"\",F79=\"\"),\"\",Z100)","v":""},null,{"$f":"IF(L96=\"\",\"\",IF(meant=1,AB100&\"%\",AC100&\"%\"))","v":""},null,null,null,null,null,"Early Number Concepts (Gc/Gf)",48,{"$f":"IF(meant=1,$L$22,$N$22)","v":55},{"$f":"IF(OR(U96=\"\",V96=\"\"),\"\",ABS(U96-V96))","v":7},{"$f":"IF(AND(btwcl=1,meant=1),6,IF(AND(btwcl=2,meant=1),8,IF(AND(btwcl=3,meant=1),10,IF(AND(btwcl=1,meant=2),6,IF(AND(btwcl=2,meant=2),8,IF(AND(btwcl=3,meant=2),11))))))","v":8},{"$f":"IF(U96=V96,\"\",IF(U96>V96,\"High\",\"Low\"))","v":"Low"},"",3,{"$f":"IF(AA96=1,LOOKUP(W96,AD101:AG101,$AD$119:$AG$119),LOOKUP(W96,AD102:AG102,$AD$119:$AG$119))","v":">15"},{"$f":"IF(AB96=3,LOOKUP(W96,AH101:AK101,$AD$119:$AG$119),LOOKUP(W96,AH102:AK102,$AD$119:$AG$119))","v":">15"},0,8,10,11,0,8,9,10]
[null,null,null,null,{"$f":"B35","v":"Speed of Information Processing (Gs)"},{"$f":"D35","v":""},null,{"$f":"X99","v":8},null,{"$f":"IF(OR(F97=\"\",F79=\"\"),\"\",U101-V101)","v":""},null,{"$f":"IF(OR(F97=\"\",F79=\"\"),\"\",Z101)","v":""},null,{"$f":"IF(L97=\"\",\"\",IF(meant=1,AB99&\"%\",AC99&\"%\"))","v":""},null,null,null,null,null,"Matching Letter Like Forms (Gv)",49,55,6,{"$f":"IF(AND(btwcl=1,meant=1),8,IF(AND(btwcl=2,meant=1),10,IF(AND(btwcl=3,meant=1),14,IF(AND(btwcl=1,meant=2),8,IF(AND(btwcl=2,meant=2),11,IF(AND(btwcl=3,meant=2),14))))))","v":10},"Low","",3,{"$f":"IF(AA97=1,LOOKUP(W97,AD103:AG103,$AD$119:$AG$119),LOOKUP(W97,AD104:AG104,$AD$119:$AG$119))","v":">15"},{"$f":"IF(AB97=3,LOOKUP(W97,AH103:AK103,$AD$119:$AG$119),LOOKUP(W97,AH104:AK104,$AD$119:$AG$119))","v":">15"},0,7,9,10,0,7,9,10,{"$f":"E86","v":"Copying (Gv)"}]
[null,null,null,null,{"$f":"B38","v":"Rapid Naming (Gs)"},{"$f":"D38","v":""},null,{"$f":"X102","v":10},null,{"$f":"IF(OR(F98=\"\",F79=\"\"),\"\",U102-V102)","v":""},null,{"$f":"IF(OR(F98=\"\",F79=\"\"),\"\",Z102)","v":""},null,{"$f":"IF(L98=\"\",\"\",IF(meant=1,AB102&\"%\",AC102&\"%\"))","v":""},null,null,null,null,null,"Phonological Processing (Ga)",{"$f":"F94","v":""},55,"",{"$f":"IF(AND(btwcl=1,meant=1),6,IF(AND(btwcl=2,meant=1),8,IF(AND(btwcl=3,meant=1),10,IF(AND(btwcl=1,meant=2),6,IF(AND(btwcl=2,meant=2),8,IF(AND(btwcl=3,meant=2),11))))))","v":8},"High","High",1,{"$f":"IF(AA98=1,LOOKUP(W98,AD105:AG105,$AD$119:$AG$119),LOOKUP(W98,AD106:AG106,$AD$119:$AG$119))","v":{"$error":"#N/A"}},{"$f":"IF(AB98=3,LOOKUP(W98,AH105:AK105,$AD$119:$AG$119),LOOKUP(W98,AH106:AK106,$AD$119:$AG$119))","v":{"$error":"#N/A"}},0,7,9,10,0,7,8,9]
[null,null,null,null,null,null,null,null,null,null,null,null,null,null,null,null,null,null,null,"Recall of Sequential Order (Gsm)","",55,"",{"$f":"IF(AND(btwcl=1,meant=1),6,IF(AND(btwcl=2,meant=1),8,IF(AND(btwcl=3,meant=1),11,IF(AND(btwcl=1,meant=2),6,IF(AND(btwcl=2,meant=2),9,IF(AND(btwcl=3,meant=2),11))))))","v":8},"High","High",1,{"$f":"IF(AA99=1,LOOKUP(W99,AD107:AG107,$AD$119:$AG$119),LOOKUP(W99,AD108:AG108,$AD$119:$AG$119))","v":{"$error":"#N/A"}},{"$f":"IF(AB99=3,LOOKUP(W99,AH107:AK107,$AD$119:$AG$119),LOOKUP(W99,AH108:AK108,$AD$119:$AG$119))","v":{"$error":"#N/A"}},0,10,12,13,0,11,14,15,{"$f":"E88","v":"Recall of Objects-Immediate (Glr)"}]
[null,null,null,null,null,null,null,null,null,null,null,null,null,null,null,null,null,null,null,"Recall of Digits Backward (Gsm)","",55,"",{"$f":"IF(AND(btwcl=1,meant=1),6,IF(AND(btwcl=2,meant=1),9,IF(AND(btwcl=3,meant=1),11,IF(AND(btwcl=1,meant=2),7,IF(AND(btwcl=2,meant=2),9,IF(AND(btwcl=3,meant=2),12))))))","v":9},"High","High",1,{"$f":"IF(AA100=1,LOOKUP(W100,AD109:AG109,$AD$119:$AG$119),LOOKUP(W100,AD110:AG110,$AD$119:$AG$119))","v":{"$error":"#N/A"}},{"$f":"IF(AB100=3,LOOKUP(W100,AH109:AK109,$AD$119:$AG$119),LOOKUP(W100,AH110:AK110,$AD$119:$AG$119))","v":{"$error":"#N/A"}},0,11,13,14,0,11,14,15]
[null,null,null,null,null,null,null,null,null,"Ability Score",null,null,null,null,null,null,null,null,null,"Speed of Information Processing (Gs)","",55,"",{"$f":"IF(AND(btwcl=1,meant=1),5,IF(AND(btwcl=2,meant=1),7,IF(AND(btwcl=3,meant=1),9,IF(AND(btwcl=1,meant=2),5,IF(AND(btwcl=2,meant=2),7,IF(AND(btwcl=3,meant=2),10))))))","v":7},"High","High",{"$f":"IF(U101<V101,3,IF(U101>V101,1,IF(U101=V101,2)))","v":1},{"$f":"IF(AA101=1,LOOKUP(W101,AD111:AG111,$AD$119:$AG$119),LOOKUP(W101,AD112:AG112,$AD$119:$AG$119))","v":{"$error":"#N/A"}},{"$f":"IF(AB101=3,LOOKUP(W101,AH111:AK111,$AD$119:$AG$119),LOOKUP(W101,AH112:AK112,$AD$119:$AG$119))","v":{"$error":"#N/A"}},0,9,11,12,0,9,11,12,{"$f":"E90","v":"Recall of Digits Forward (Gsm)"}]
[null,null,"Phonological Processing (Ability Score Comparisons)",null,null,null,null,null,null,"Difference",null,"Critical Value",null,"Significance",null,null,null,null,null,null,{"$f":"F98","v":""},55,"",{"$f":"IF(AND(btwcl=1,meant=1),7,IF(AND(btwcl=2,meant=1),10,IF(AND(btwcl=3,meant=1),13,IF(AND(btwcl=1,meant=2),7,IF(AND(btwcl=2,meant=2),10,IF(AND(btwcl=3,meant=2),13))))))","v":10},"High","High",{"$f":"IF(U102<V102,3,IF(U102>V102,1,2))","v":1},{"$f":"IF(AA102=1,LOOKUP(W102,AD113:AG113,$AD$119:$AG$119),LOOKUP(W102,AD114:AG114,$AD$119:$AG$119))","v":{"$error":"#N/A"}},{"$f":"IF(AB102=3,LOOKUP(W102,AH113:AK113,$AD$119:$AG$119),LOOKUP(W102,AH114:AK114,$AD$119:$AG$119))","v":{"$error":"#N/A"}},0,10,11,12,0,10,13,13]
[null,null,null,null,null,null,null,{"$f":"'Input page School-age'!C38&\" versus \"&'Input page School-age'!C40","v":"Task 1 (Rhyming) versus Task 2 (Blending)"},null,{"$f":"IF(AA105=1,\"\",W105)","v":""},null,{"$f":"IF(J103=\"\",\"\",Z105)","v":""},null,{"$f":"IF(AA105=1,\"\",IF(J103=\"\",\"\",IF(J103>=L103,\"Yes\",\"No\")))","v":""},null,null,null,null,null,null,null,null,null,null,null,null,null,null,null,0,8,10,11,0,8,11,12,{"$f":"E91","v":"Recognition of Pictures (Gv)"}]
[null,null,null,null,null,null,null,{"$f":"'Input page School-age'!C38&\" versus \"&'Input page School-age'!C42","v":"Task 1 (Rhyming) versus Task 3 (Deletion)"},null,"",null,"",null,"",null,null,null,null,null,null,"ab","ab","diff","sem","sem2","cv",null,null,null,0,8,10,11,0,9,11,12]
[null,null,null,null,null,null,null,{"$f":"'Input page School-age'!C38&\" versus \"&'Input page School-age'!C44","v":"Task 1 (Rhyming) versus Task 4 (Phoneme Identification and Segmentation)"},null,"",null,"",null,"",null,null,null,null,null,12,{"$f":"IF('Input page School-age'!D38=\"\",\"\",'Input page School-age'!D38)","v":""},{"$f":"IF('Input page School-age'!D40=\"\",\"\",'Input page School-age'!D40)","v":""},{"$f":"IF(OR('Input page School-age'!D38=\"\",'Input page School-age'!D40=\"\"),\"\",ABS(U105-V105))","v":""},{"$f":"IF('Input page School-age'!F38=\"\",\"\",'Input page School-age'!F38)","v":""},{"$f":"IF('Input page School-age'!F40=\"\",\"\",'Input page School-age'!F40)","v":""},{"$f":"IF(OR(X105=\"\",Y105=\"\"),\"\",1.65*SQRT(X105^2+Y105^2))","v":""},{"$f":"IF(U105=\"\",1,IF(V105=\"\",1, IF(Y105=\"\",1,IF(Z105=\"\",1,0))))","v":1},null,null,0,9,11,12,0,9,12,13,{"$f":"E95","v":"Recall of Sequential Order (Gsm)"}]
[null,null,null,null,null,null,null,{"$f":"'Input page School-age'!C40&\" versus \"&'Input page School-age'!C42","v":"Task 2 (Blending) versus Task 3 (Deletion)"},null,"",null,"",null,"",null,null,null,null,null,13,{"$f":"IF('Input page School-age'!D38=\"\",\"\",'Input page School-age'!D38)","v":""},{"$f":"IF('Input page School-age'!D42=\"\",\"\",'Input page School-age'!D42)","v":""},{"$f":"IF(OR('Input page School-age'!D38=\"\",'Input page School-age'!D42=\"\"),\"\",ABS(U106-V106))","v":""},{"$f":"IF('Input page School-age'!F38=\"\",\"\",'Input page School-age'!F38)","v":""},{"$f":"IF('Input page School-age'!F42=\"\",\"\",'Input page School-age'!F42)","v":""},"",1,null,null,0,9,10,11,0,9,11,12]
[null,null,null,null,null,null,null,{"$f":"'Input page School-age'!C40&\" versus \"&'Input page School-age'!C44","v":"Task 2 (Blending) versus Task 4 (Phoneme Identification and Segmentation)"},null,"",null,"",null,"",null,null,null,null,null,14,{"$f":"IF('Input page School-age'!D38=\"\",\"\",'Input page School-age'!D38)","v":""},{"$f":"IF('Input page School-age'!D44=\"\",\"\",'Input page School-age'!D44)","v":""},{"$f":"IF(OR('Input page School-age'!D38=\"\",'Input page School-age'!D44=\"\"),\"\",ABS(U107-V107))","v":""},{"$f":"IF('Input page School-age'!F38=\"\",\"\",'Input page School-age'!F38)","v":""},{"$f":"IF('Input page School-age'!F44=\"\",\"\",'Input page School-age'!F44)","v":""},"",1,null,null,0,9,13,14,0,10,11,12,{"$f":"E97","v":"Speed of Information Processing (Gs)"}]
[null,null,null,null,null,null,null,{"$f":"'Input page School-age'!C42&\" versus \"&'Input page School-age'!C44","v":"Task 3 (Deletion) versus Task 4 (Phoneme Identification and Segmentation)"},null,"",null,"",null,"",null,null,null,null,null,23,{"$f":"IF('Input page School-age'!D40=\"\",\"\",'Input page School-age'!D40)","v":""},{"$f":"IF('Input page School-age'!D42=\"\",\"\",'Input page School-age'!D42)","v":""},{"$f":"IF(OR('Input page School-age'!D42=\"\",'Input page School-age'!D40=\"\"),\"\",ABS(U108-V108))","v":""},{"$f":"IF('Input page School-age'!F40=\"\",\"\",'Input page School-age'!F40)","v":""},{"$f":"IF('Input page School-age'!F42=\"\",\"\",'Input page School-age'!F42)","v":""},"",1,null,null,0,10,12,13,0,10,13,14]
[null,null,null,null,null,null,null,null,null,null,null,null,null,null,null,null,null,null,null,24,{"$f":"IF('Input page School-age'!D40=\"\",\"\",'Input page School-age'!D40)","v":""},{"$f":"IF('Input page School-age'!D44=\"\",\"\",'Input page School-age'!D44)","v":""},{"$f":"IF(OR('Input page School-age'!D44=\"\",'Input page School-age'!D40=\"\"),\"\",ABS(U109-V109))","v":""},{"$f":"IF('Input page School-age'!F40=\"\",\"\",'Input page School-age'!F40)","v":""},{"$f":"IF('Input page School-age'!F44=\"\",\"\",'Input page School-age'!F44)","v":""},"",1,null,null,0,7,9,10,0,7,10,11,{"$f":"E96","v":"Recall of Digits Backward (Gsm)"}]
[null,null,null,null,null,null,null,null,null,null,null,null,null,null,null,null,null,null,null,34,{"$f":"IF('Input page School-age'!D42=\"\",\"\",'Input page School-age'!D42)","v":""},{"$f":"IF('Input page School-age'!D44=\"\",\"\",'Input page School-age'!D44)","v":""},{"$f":"IF(OR('Input page School-age'!D44=\"\",'Input page School-age'!D42=\"\"),\"\",ABS(U110-V110))","v":""},{"$f":"IF('Input page School-age'!F42=\"\",\"\",'Input page School-age'!F42)","v":""},{"$f":"IF('Input page School-age'!F44=\"\",\"\",'Input page School-age'!F44)","v":""},"",1,null,null,0,10,12,13,0,9,12,13]
[null,null,"Rapid Naming (Ability Score Comparisons)",null,null,null,null,null,null,null,null,null,null,null,null,null,null,null,null,null,null,null,null,null,null,null,null,null,null,0,8,9,10,0,8,10,11,{"$f":"E94","v":"Phonological Processing (Ga)"}]
[null,null,null,null,null,null,null,{"$f":"'Input page School-age'!C47&\" versus \"&'Input page School-age'!C49","v":"Simple Naming versus Complex Naming"},null,{"$f":"IF(AA114=1,\"\",W114)","v":""},null,{"$f":"IF(J112=\"\",\"\",Z114)","v":""},null,{"$f":"IF(AA114=1,\"\",IF(J112=\"\",\"\",IF(J112>=L112,\"Yes\",\"No\")))","v":""},null,null,null,null,null,null,null,null,null,null,null,null,null,null,null,0,9,12,13,0,10,13,14]
[null,null,null,null,null,null,null,null,null,null,null,null,null,null,null,null,null,null,null,null,null,null,null,null,null,null,null,null,null,0,8,10,11,0,8,10,11,{"$f":"E98","v":"Rapid Naming (Gs)"}]
[null,null,null,null,null,null,null,null,null,null,null,null,null,null,null,null,null,null,null,null,{"$f":"IF('Input page School-age'!D47=\"\",\"\",'Input page School-age'!D47)","v":""},{"$f":"IF('Input page School-age'!D49=\"\",\"\",'Input page School-age'!D49)","v":""},{"$f":"IF(OR('Input page School-age'!D47=\"\",'Input page School-age'!D49=\"\"),\"\",ABS(U114-V114))","v":""},{"$f":"IF('Input page School-age'!F47=\"\",\"\",'Input page School-age'!F47)","v":""},{"$f":"IF('Input page School-age'!F49=\"\",\"\",'Input page School-age'!F49)","v":""},{"$f":"IF(OR(X114=\"\",Y114=\"\"),\"\",1.65*SQRT(X114^2+Y114^2))","v":""},{"$f":"IF(U114=\"\",1,IF(V114=\"\",1, IF(Y114=\"\",1,IF(Z114=\"\",1,0))))","v":1},null,null,0,9,12,13,0,9,11,12]
[null,null,null,null,null,null,null,null,null,null,null,null,null,null,null,null,null,null,null,null,null,null,null,null,null,null,null,null,null,0,6,8,9,0,7,10,11]
[null,null,null,null,null,null,null,null,null,null,null,null,null,null,null,null,null,null,null,null,null,null,null,null,null,null,null,null,null,0,7,8,9,0,8,9,10]
[null,null,null,null,null,null,null,null,null,null,null,null,null,null,null,null,null,null,null,null,null,null,null,null,null,null,null,null,null,0,9,12,13,0,9,11,12]
[null,null,null,null,null,null,null,null,null,null,null,null,null,null,null,null,null,null,null,null,"GCA",{"$f":"gca","v":111},null,null,null,null,null,null,null,0,8,10,11,0,9,11,12]
[null,null,null,null,null,null,null,null,null,null,null,null,null,null,null,null,null,null,null,null,"SNC",{"$f":"snc","v":107},null,null,null,null,null,null,null,">15",15,10,"<10",">15",15,10,"<10"]
[]
[null,null,null,null,null,null,null,null,null,null,null,null,null,null,null,null,null,null,null,null,"Verbal",{"$f":"verb","v":113}]
[null,null,null,null,null,null,null,null,null,null,null,null,null,null,null,null,null,null,null,null,"Nonverbal Reasoning",{"$f":"nverb","v":117}]
[null,null,null,null,null,null,null,null,null,null,null,null,null,null,null,null,null,null,null,null,"Spatial",{"$f":"sp","v":95}]
[]
[null,null,null,null,null,null,null,null,null,null,null,null,null,null,null,null,null,null,null,null,"Working Memory",{"$f":"wm","v":""}]
[null,null,null,null,null,null,null,null,null,null,null,null,null,null,null,null,null,null,null,null,"Processing Speed",{"$f":"ps","v":""}]
[null,null,null,null,null,null,null,null,null,null,null,null,null,null,null,null,null,null,null,null,"School Readiness",{"$f":"sr","v":""}]
[null,null,null,null,null,null,null,null,null,null,null,null,null,null,null,null,null,null,null,null,{"$f":"E81","v":"Verbal Comprehension (Gc)"},53,null,"Verbal Conceptualization","VC, NV, ENC",null,0.6,10.07,null,8.11]
[null,null,null,null,null,null,null,null,null,null,null,null,null,null,null,null,null,null,null,null,"Naming Vocabulary (Gc)",62,null,"Formulation and Testing of Hypotheses","VC, PS, PC, Mat",null,0.51,-1.02,null,7.53]
[null,null,null,null,null,null,null,null,null,null,null,null,null,null,null,null,null,null,null,null,"Picture Similarities (Gf)",56,null,"Use of Verbal Mediation to Solve Nonverbal Problems","PS, PC, Mat",null,0.64,3.53,null,8.19]
[null,null,null,null,null,null,null,null,null,null,null,null,null,null,null,null,null,null,null,null,"Matrices (Gf)",63,null,"Verbal Comprehension:","VC, ENC, RSO",null,0.64,4.2300000000000004,null,7.78]
[null,null,null,null,null,null,null,null,null,null,null,null,null,null,null,null,null,null,null,null,"Pattern Construction (Gv)",46,null,"Verbal Expression:","NV, ROi , RDf, RSO, RDb, PhP, RN",null,0.32,-12.96,null,6.2]
[null,null,null,null,null,null,null,null,null,null,null,null,null,null,null,null,null,null,null,null,"Copying (Gv)",49,null,"Visual Analysis of Pictures:","VC, PS, Mat, ROi, RPic",null,0.44,-10.199999999999999,null,8.48]
[null,null,null,null,null,null,null,null,null,null,null,null,null,null,null,null,null,null,null,null,null,null,null,"Visual Analysis of Figures or Designs:","PSim, PC, Mat, Copy, MLLF",null,0.41,-2.98,null,6.68]
[null,null,null,null,null,null,null,null,null,null,null,null,null,null,null,null,null,null,null,null,{"$f":"E88","v":"Recall of Objects-Immediate (Glr)"},52,null,"Spatial Visualization and Orientation:","PC, Copy, MLLF",null,0.62,7.21,null,6.73]
[null,null,null,null,null,null,null,null,null,null,null,null,null,null,null,null,null,null,null,null,"Recall of Objects-Delayed (Glr)","",null,"Visual Verbal Integration:","PSim, Mat, ROi, RSO",null,0.57999999999999996,-16.420000000000002,null,9.48]
[null,null,null,null,null,null,null,null,null,null,null,null,null,null,null,null,null,null,null,null,"Recall of Digits Forward (Gsm)",50,null,"Short-term Memory: (general):","ROi, RDf, RPic, RSO, RDb",null,0.44,-10.97,null,7.5]
[null,null,null,null,null,null,null,null,null,null,null,null,null,null,null,null,null,null,null,null,"Recognition of Pictures (Gv)",47,null,"Auditory Short-term Memory:","RDf, RSO, RDb,",null,0.68,-1.44,null,7.4]
[null,null,null,null,null,null,null,null,null,null,null,null,null,null,null,null,null,null,null,null,"Early Number Concepts",{"$f":"J32","v":48},null,"Visual Short-term Memory:","ROi, RPic",null,0.91,8.7100000000000009,null,11.76]
[null,null,null,null,null,null,null,null,null,null,null,null,null,null,null,null,null,null,null,null,"Matching Letter-like Forms",{"$f":"J33","v":49},null,"Verbal Long-term Information Retrieval:","NV, ENC, RN",null,0.69,-2.91,null,9.56]
[null,null,null,null,null,null,null,null,null,null,null,null,null,null,null,null,null,null,null,null,{"$f":"E94","v":"Phonological Processing (Ga)"},"",null,"Visual/holistic Information Processing:","PSim, PC, Mat, Copy, RPic, MLLF",null,0.35,-5.77,null,6.54]
[null,null,null,null,null,null,null,null,null,null,null,null,null,null,null,null,null,null,null,null,"Recall of Sequential Order (Gsm)","",null,"Sequential Information Processing:","VC, ROi, RDf, RSO, SIP, RDb, RN",null,0.33,-16.350000000000001,null,6.46]
[null,null,null,null,null,null,null,null,null,null,null,null,null,null,null,null,null,null,null,null,"Recall of Digits Backward (Gsm)",""]
[null,null,null,null,null,null,null,null,null,null,null,null,null,null,null,null,null,null,null,null,"Speed of Information Processing (Gs)",""]
[null,null,null,null,null,null,null,null,null,null,null,null,null,null,null,null,null,null,null,null,"Rapid Naming (Gs)",""]
[]
[]
[]
[]
[]
[]
[]
[]
[]
[]
[]
[]
[]
[]
[]
[]
[]
[]
[]
[]
[]
[]
[]
[]
[]
[]
[]
[]
[]
[]
[]
[]
[]
[]
[]
[]
[]
[]
[]
[]
[]
[]
[]
[]
[]
[]
[]
[]
[]
[]
[]
[]
[]
[]
[]
[]
[]
[]
[]
[]
[]
[]
[]
[]
[]
[]
[]
[]
[]
[]
[]
[]
[]
[]
[]
[]
[]
[]
[]
[]
[]
[]
[]
[]
[]
[]
[]
[]
[]
[]
[]
[]
[]
[]
[]
[]
[]
[]
[]
[]
[]
[]
[]
[]
[]
[]
[]
[]
[]
[]
[]
[]
[]
[]
[]
[]
[]
[]
[]
[]
[]
[]
[]
[]
[]
[]
[]
[]
[]
[]
[]
[]
[]
[]
[]
[]
[]
[]
[]
[]
[]
[]
[]
[]
[]
[]
[]
[]
[]
[]
[]
[]
[]
[]
[]
[]
[]
[]
[null,null,"sum",20,{"$f":"D304+1","v":21},22,23,24,25,26,27,28,29,30,31,32,33,34,35,36,37,38,39,40,41,42,43,44,45,46,47,48,49,50,51,52,{"$f":"AJ304+1","v":53},54,55,56,57,58,59,60,61,62,63,64,65,66,67,68,69,70,71,72,73,74,75,76,77,78,79,80,81,82,83,84,{"$f":"BP304+1","v":85},86,87,88,89,90,91,92,93,94,95,96,97,98,99,100,101,102,103,104,105,106,107,108,109,110,111,112,113,114,115,116,{"$f":"CV304+1","v":117},118,119,120,121,122,123,124,125,126,127,128,129,130,131,132,133,134,135,136,137,138,139,140,141,142,143,144,145,146,147,148,{"$f":"EB304+1","v":149},150,151,152,153,154,155,156,157,158,159,160,161,162,163,164,165,166,167,168,169,170,171,172,173,174,175,176,177,178,179,180]
[null,null,"wm",33,34,35,36,37,38,39,40,41,42,42,"43 .",44,45,46,47,48,49,50,50,51,52,53,54,55,56,57,58,59,59,60,61,62,63,64,65,66,66,67,68,69,70,70,71,72,72,73,74,74,75,76,76,77,78,78,79,80,81,81,82,83,84,85,85,86,87,88,89,89,90,91,92,93,94,95,96,96,97,98,99,100,101,102,103,104,105,105,106,107,108,109,110,111,112,113,113,114,115,116,117,118,119,119,120,121,122,123,124,124,125,126,127,128,129,129,130,131,132,133,134,134,135,136,137,138,139,139,140,141,142,143,144,144,145,146,147,149,148,149,150,151,152,152,153,154,155,156,157,157,158,159,160,161,162,163,164,165,166,167,168,169]
[null,null,"pr","<0.1","<0.1","<0.1","<0.1","<0.1","<0.1","<0.1","<0.1","<0.1","<0.1","<0.1","<0.1","<0.1","<0.1","<0.1","<0.1","<0.1","<0.1","<0.1","<0.1",0.1,0.1,0.1,0.1,0.1,0.2,0.2,0.3,0.3,0.3,0.4,0.5,1,1,1,1,1,1,1,2,2,2,2,3,3,3,4,4,4,5,5,5,6,7,7,8,9,10,10,12,13,14,16,16,18,19,21,23,23,25,27,30,32,34,37,39,39,42,45,47,50,53,55,58,61,63,63,66,68,70,73,75,77,79,81,81,82,84,86,87,88,90,90,91,92,93,94,95,95,95,96,96,97,97,97,98,98,98,99,99,99,99,99,99,99,99.5,99.5,99.6,99.7,99.7,99.8,99.8,99.8,99.9,99.9,99.9,99.9,99.9,99.9,">99.9",">99.9",">99.9",">99.9",">99.9",">99.9",">99.9",">99.9",">99.9",">99.9",">99.9",">99.9",">99.9",">99.9",">99.9",">99.9",">99.9",">99.9",">99.9",">99.9",">99.9",">99.9"]
[null,null,"90p","31-42","32-43","33-43","34-44","35-45","36-46","37-47","38-48","39-49","40-50","40-50","41-51","42-52","43-53","43-54","44-55","45-56","46-57","47-58","47-58","48-59","49-60","50-61","51-62","52-62","53-63","54-64","55-65","56-66","56-66","57-67","58-68","59-69","60-70","61-71","62-72","62-73","62-73","63-74","64-75","65-76","66-77","66-77","67-78","68-79","68-79","69-80","70-81","70-81","71-81","72-82","72-82","73-83","74-84","74-84","75-85","76-86","77-87","77-87","78-88","79-89","80-90","81-91","81-91","81-92","82-93","83-94","84-95","84-95","85-96","86-97","87-98","88-99","89-100","90-100","91-101","91-101","92-102","93-103","94-104","95-105","96-106","97-107","98-108","99-109","100-110","100-110","100-111","101-112","102-113","103-114","104-115","105-116","106-117","107-118","107-118","108-119","109-119","110-120","111-121","112-122","113-123","113-123","114-124","115-125","116-126","117-127","118-128","118-128","119-129","119-130","120-131","121-132","122-133","122-133","123-134","124-135","125-136","126-137","127-138","127-138","128-138","129-139","130-140","131-141","132-142","132-142","133-143","134-144","135-145","136-146","137-147","137-147","138-148","138-149","139-150","140-151","140-151","141-152","142-153","143-154","144-155","144-155","145-156","146-157","147-157","148-158","149-159","149-159","150-160","151-161","152-162","153-163","154-164","155-165","156-166","157-167","157-168","158-169","159-170","160-171"]
[null,null,"95p","30-43","31-44","32-44","33-45","34-46","35-47","36-48","37-49","38-50","39-51","39-51","40-52","41-53","42-54","42-55","43-56","44-57","45-58","46-59","46-59","47-60","48-61","49-62","50-63","51-63","52-64","53-65","54-66","55-67","55-67","56-68","57-69","58-70","59-71","60-72","61-73","61-74","61-74","62-75","63-76","64-77","65-78","65-78","66-79","67-80","67-80","68-81","69-82","69-82","70-82","71-83","71-83","72-84","73-85","73-85","74-86","75-87","76-88","76-88","77-89","78-90","79-91","80-92","80-92","80-93","81-94","82-95","83-96","83-96","84-97","85-98","86-99","87-100","88-101","89-101","90-102","90-102","91-103","92-104","93-105","94-106","95-107","96-108","97-109","98-110","99-111","99-111","99-112","100-113","101-114","102-115","103-116","104-117","105-118","106-119","106-119","107-120","108-120","109-121","110-122","111-123","112-124","112-124","113-125","114-126","115-127","116-128","117-129","117-129","118-130","118-131","119-132","120-133","121-134","121-134","122-135","123-136","124-137","125-138","126-139","126-139","127-139","128-140","129-141","130-142","131-143","131-143","132-144","133-145","134-146","135-147","136-148","136-148","137-149","137-150","138-151","139-152","139-152","140-153","141-154","142-155","143-156","143-156","144-157","145-158","146-158","147-159","148-160","148-160","149-161","150-162","151-163","152-164","153-165","154-166","155-167","156-168","156-169","157-170","158-171","159-172"]
[]
[]
[]
[]
[]
[]
[]
[null,null,"psss",20,{"$f":"D316+1","v":21},22,23,24,25,26,27,28,29,30,31,32,33,34,35,36,37,38,39,40,41,42,43,44,45,46,47,48,49,50,51,52,{"$f":"AJ316+1","v":53},54,55,56,57,58,59,60,61,62,63,64,65,66,67,68,69,70,71,72,73,74,75,76,77,78,79,80,81,82,83,84,{"$f":"BP316+1","v":85},86,87,88,89,90,91,92,93,94,95,96,97,98,99,100,101,102,103,104,105,106,107,108,109,110,111,112,113,114,115,116,{"$f":"CV316+1","v":117},118,119,120,121,122,123,124,125,126,127,128,129,130,131,132,133,134,135,136,137,138,139,140,141,142,143,144,145,146,147,148,{"$f":"EB316+1","v":149},150,151,152,153,154,155,156,157,158,159,160,161,162,163,164,165,166,167,168,169,170,171,172,173,174,175]
[null,null,null,30,30,30,30,30,31,32,33,34,35,36,37,38,39,39,40,41,42,43,44,45,46,47,48,49,49,50,51,52,53,54,55,56,57,58,59,59,60,61,62,63,64,65,66,67,68,69,69,70,71,72,73,74,75,76,77,78,79,79,80,81,82,83,84,85,86,87,88,89,89,90,91,92,93,94,95,96,97,98,99,100,101,102,103,104,105,106,107,108,109,109,110,111,112,113,114,115,116,117,118,119,119,120,121,122,123,124,125,126,127,128,129,129,130,131,132,133,134,135,136,137,138,139,139,140,141,142,143,144,145,146,147,148,149,149,150,151,152,153,154,155,156,157,158,159,160,161,162,163,164,165,166,167,168,169,170]
[]
[null,null,"gcasum",60,63,64,67,69,70,73,75,77,80,81,83,86,87,90,93,94,98,99,101,105,108,111,112,115,117,119,123,127,129,131,134,135,138,141,145,147,148,152,153,155,158,159,161,165,169,171,174,177,181,183,184,188,189,191,195,199,201,202,206,207,210,213,214,218,219,222,225,228,231,232,236,237,240,243,244,246,249,252,255,258,261,265,267,268,272,273,274,277,279,280,283,285,286,289,291,294,297,300,303,307,309,310,313,315,317,320,321,323,326,327,328,331,333,334,337,339,340,343,345,346,349,351,352,355,357,358,361,363,366,369,371,373,375,376,378,381,384,386,387,389,392,393,395,398,399,401,404,405,408,411,414,417,420,423,426,429,432,435,437,440,441,443,446,447,448,451,453,454,457,459,460,463,465,466,469,471,472,475,477,478,481,483,484,487,489,490,493,495,496,499,501,502,505,507,513,519,525,531,537]
[null,null,null,30,30,31,32,32,33,34,34,35,36,36,37,38,38,39,39,40,41,41,42,43,44,44,45,46,46,47,48,49,49,50,51,51,52,53,54,54,55,56,56,57,58,58,59,60,61,61,62,63,64,64,65,66,66,67,68,69,69,70,71,71,72,72,73,74,74,75,76,77,77,78,79,79,80,80,81,82,83,84,85,86,87,88,88,89,90,90,91,92,92,93,94,94,95,96,97,98,99,100,101,102,102,103,104,104,105,106,106,107,108,108,109,110,110,111,112,112,113,114,114,115,116,116,117,118,118,119,120,121,122,123,124,125,125,126,127,128,129,130,130,131,132,132,133,134,134,135,136,136,137,138,139,140,141,142,143,144,145,146,147,148,148,149,150,150,151,152,152,153,154,154,155,156,156,157,158,158,159,160,160,161,162,162,163,164,164,165,166,166,167,168,168,169,170,170,170,170,170,170,170]
[]
[null,null,"t",10,{"$f":"D322+1","v":11},12,13,14,15,16,17,18,19,20,21,22,23,24,25,26,27,28,29,30,31,32,33,34,35,36,37,38,39,40,41,42,{"$f":"AJ322+1","v":43},44,45,46,47,48,49,50,51,52,53,54,55,56,57,58,59,60,61,62,63,64,65,66,67,68,69,70,71,72,73,74,{"$f":"BP322+1","v":75},76,77,78,79,80,81,82,83,84,85,86,87,88,89,90]
[null,null,"PR","<.1","<.1","<.1","<.1","<.1","<.1","<.1","<.1","<.1",0.1,0.1,0.2,0.3,0.4,0.5,1,1,1,1,2,2,3,4,4,5,7,8,10,12,14,16,17,21,24,27,31,34,38,42,48,50,54,58,62,66,69,73,76,79,82,84,86,88,90,92,93,95,96,96,97,98,98,99,99,99,99,99.5,99.7,99.7,99.8,99.9,99.9,99.9,">99.9",">99.9",">99.9",">99.9",">99.9",">99.9",">99.9",">99.9"]
[]
[null,null,"Vts",20,{"$f":"D325+1","v":21},22,23,24,25,26,27,28,29,30,31,32,33,34,35,36,37,38,39,40,41,42,43,44,45,46,47,48,49,50,51,52,{"$f":"AJ325+1","v":53},54,55,56,57,58,59,60,61,62,63,64,65,66,67,68,69,70,71,72,73,74,75,76,77,78,79,80,81,82,83,84,{"$f":"BP325+1","v":85},86,87,88,89,90,91,92,93,94,95,96,97,98,99,100,101,{"$f":"CG325+1","v":102},103,104,105,106,107,108,109,110,111,112,113,114,115,116,117,118,119,120,121,122,123,124,125,126,127,128,129,130,131,132,133,{"$f":"DM325+1","v":134},135,136,137,138,139,140,141,142,143,144,145,146,147,148,149,150,151,152,153,154,155,156,157,158,159,160,161,162,163,164,165,{"$f":"ES325+1","v":166},167,168,169,170,171,172,173,174,175,176,177,178,179,180]
[null,null,"Vcls",31,32,33,34,35,36,37,38,39,40,41,42,43,44,45,45,46,47,48,49,50,51,51,52,53,54,55,56,57,57,58,59,60,61,62,63,63,64,65,66,67,68,69,70,70,71,72,73,73,74,75,76,77,77,78,79,80,80,81,82,83,83,84,85,86,86,87,88,89,89,90,91,92,93,94,95,96,97,98,99,100,101,102,103,103,104,105,106,106,107,108,109,109,110,111,112,113,114,115,116,117,118,119,102,120,121,122,123,123,124,125,126,127,128,128,129,130,131,132,133,133,134,135,136,137,138,138,139,140,141,142,143,143,144,145,146,147,148,148,149,150,151,152,153,153,154,155,156,157,158,159,160,161,162,163,164,165,166,167,168,169]
[null,null,"NVts",20,{"$f":"D327+1","v":21},22,23,24,25,26,27,28,29,30,31,32,33,34,35,36,37,38,39,40,41,42,43,44,45,46,47,48,49,50,51,52,{"$f":"AJ327+1","v":53},54,55,56,57,58,59,60,61,62,63,64,65,66,67,68,69,70,71,72,73,74,75,76,77,78,79,80,81,82,83,84,{"$f":"BP327+1","v":85},86,87,88,89,90,91,92,93,94,95,96,97,98,99,{"$f":"CE327+1","v":100},101,102,103,104,105,106,107,108,109,110,111,112,113,114,115,116,117,118,119,120,121,122,123,124,125,126,127,128,129,130,131,{"$f":"DK327+1","v":132},133,134,135,136,137,138,139,140,141,142,143,144,145,146,147,148,149,150,151,152,153,154,155,156,157,158,159,160,161,162,163,{"$f":"EQ327+1","v":164},165,166,167,168,169,170,171,172,173,174,175,176,177,178,179,180]
[null,null,"NVcls",31,32,33,34,35,36,37,38,39,40,41,42,43,44,45,46,47,48,49,49,50,51,52,53,54,54,55,56,57,58,59,59,60,61,62,63,64,64,65,66,67,68,69,69,70,71,72,73,74,74,75,76,77,78,79,79,80,81,82,83,84,84,85,86,87,88,89,89,90,91,92,93,93,94,95,96,97,97,98,99,100,100,101,102,103,103,104,105,106,107,107,108,109,110,111,111,112,113,114,115,115,116,117,118,119,120,120,121,122,123,123,124,125,126,127,127,128,129,130,131,131,132,133,134,135,135,136,137,138,139,139,140,141,142,143,143,144,145,146,147,147,148,149,150,151,151,152,153,154,155,156,157,158,159,160,161,162,163,164,165,166]
[null,null,"Spts",20,{"$f":"D329+1","v":21},22,23,24,25,26,27,28,29,30,31,32,33,34,35,36,37,38,39,40,41,42,43,44,45,46,47,48,49,50,51,52,{"$f":"AJ329+1","v":53},54,55,56,57,58,59,60,61,62,63,64,65,66,67,68,69,70,71,72,73,74,75,76,77,78,79,80,81,82,83,84,{"$f":"BP329+1","v":85},86,87,88,89,90,91,92,93,94,95,96,97,98,99,100,101,102,{"$f":"CH329+1","v":103},104,105,106,107,108,109,110,111,112,113,114,115,116,117,118,119,120,121,122,123,124,125,126,127,128,129,130,131,132,133,134,{"$f":"DN329+1","v":135},136,137,138,139,140,141,142,143,144,145,146,147,148,149,150,151,152,153,154,155,156,157,158,159,160,161,162,163,164,165,166,{"$f":"ET329+1","v":167},168,169,170,171,172,173,174,175,176,177,178,179,180]
[null,null,"Spcls",32,33,34,35,36,37,38,38,39,40,41,42,43,43,44,45,46,47,48,48,49,50,51,52,53,53,54,55,56,57,58,58,59,60,61,62,63,63,64,65,66,67,68,68,69,70,71,72,73,73,74,75,76,77,78,78,79,80,81,82,83,83,84,85,86,87,88,88,89,90,91,92,93,94,94,95,96,97,98,99,100,100,101,102,103,104,105,106,107,107,108,109,110,111,112,113,114,115,115,116,117,118,119,120,120,121,122,123,124,125,126,126,127,128,129,130,131,132,132,133,134,135,136,137,138,139,139,140,141,142,143,144,145,146,146,147,148,149,150,151,152,153,154,154,155,156,157,158,159,160,161,162,163,164,165,166,167,168,169,170,170]
[null,null,"SumT",120,123,126,130,133,137,140,144,147,150,154,157,161,164,168,171,174,178,181,185,188,192,195,199,202,206,209,213,217,220,224,227,230,233,237,240,244,247,250,253,256,259,262,265,268,271,274,277,280,283,286,289,292,295,298,300,303,307,310,313,316,320,323,326,329,332,335,338,340,343,346,348,351,354,356,359,362,365,368,371,374,377,379,382,385,388,390,393,396,398,401,404,406,409,412,415,417,420,423,425,428,431,433,436,439,442,444,447,450,453,455,458,461,463,466,469,471,474,477,480]
[null,null,"GCA",45,46,47,48,49,50,51,52,53,54,55,56,57,58,59,60,61,62,63,64,65,66,67,68,69,70,71,72,73,74,75,76,77,78,79,80,81,82,83,84,85,86,87,88,89,90,91,92,93,94,95,96,97,98,99,100,101,102,103,104,105,106,107,108,109,110,111,112,113,114,115,116,117,118,119,120,121,122,123,124,125,126,127,128,129,130,131,132,133,134,135,136,137,138,139,140,141,142,143,144,145,146,147,148,149,150,151,152,153,154,155,156,157,158,159,160,161,162,163,164]
[null,null,"SS",40,62,68,71,73,75,77,78,79,80,81,82,83,84,85,86,87,88,89,90,91,92,93,94,95,96,97,98,99,100,101,102,103,104,105,106,107,108,109,110,111,112,113,114,115,116,117,118,119,120,121,122,123,124,126,129,131,133]
[null,null,"%ile",1,1,2,3,4,5,6,7,8,9,10,12,13,14,16,18,19,21,23,25,27,30,32,34,37,39,42,45,47,50,53,55,58,61,63,66,68,70,73,75,77,79,81,82,84,86,87,88,90,91,92,93,94,95,96,97,98,99]
[null,null,"verbal",51,57,65,72,81,88,97,104,113,120,129,136,144]
[null,null,"-",7,8,8,9,9,10,10,11,11,12,12,13,13]
[null,null,"+",13,13,12,12,11,11,10,10,9,9,8,8,7]
[null,null,"Nverbal",52,58,65,77,85,97,104,116,124,136,143]
[null,null,"-",7,7,8,8,9,9,10,10,11,11,12]
[null,null,"+",12,11,11,10,10,9,9,8,8,7,7]
[null,null,"Spatial",50,53,54,76,78,100,101,123,125,147,148]
[null,null,"-",6,6,7,7,8,8,9,9,10,10,11]
[null,null,"+",11,10,10,9,9,8,8,7,7,6,6]
[null,null,"GCA",44,57,62,98,103,139,144]
[null,null,"-",5,5,6,6,7,7,8]
[null,null,"+",8,7,7,6,6,5,5]
[null,null,null,1,70,80,90,110,120,130]
[null,null,null,"Very Low","Low","Below average","Average","Above average","High","Very High"]
[null,null,"GCAV",0,11,13,15,18,20,23]
[null,null,"GCAnv",0,9,11,13,16,19,22]
[null,null,"GCAsp",0,10,13,15,17,21,23]
[null,null,"Vnv",0,15,19,22,26,32,26]
[null,null,"Vsp",0,17,21,24,28,34,37]
[null,null,"Nvsp",0,14,19,21,25,30,34]
[null,null,"WS",0,9,11,13,16,19,22]
[null,null,"MSEQ",0,10,13,15,18,20,23]
[null,null,"RDPC",0,10,13,15,18,23,25]
[null,null,"%",50,25,10,10,5,2,1]
[null,null,"SNvCompT",80,82,85,87,90,92,95,97,99,102,104,107,109]
[null,null,"SNvComp",48,{"$f":"D360+1","v":49},50,51,52,53,54,55,56,57,58,59,60]
[null,null,"snvcomp",48,49,83,84,117,118,152,153,159,160]
[null,null,"-",6,6,7,7,8,8,9,9,9,11]
[null,null,"+",9,8,8,7,7,6,6,5,5,5,null,null,null,111,114,116,119,121,124,126,129,131,134,136,139,142,144,147,149,151,153,156,158,160,162,165,167,169,171,173,175,177,179,181,183,186,188,190,192,194,196,198,200,203,205,207,209,212,214,216,218,221,223,225,227,229,231,233,235,237,239,241,243,245,247,249,252,254,256,258,260,262,264,265,267,269,271,272,274,276,278,280,281,283,285,286,288,290,292,293,295,297,299,300,302,304,306,307,309,311,312,314,316,318,319]
[null,null,null,null,null,null,null,null,null,null,null,null,null,null,null,null,{"$f":"P360+1","v":61},{"$f":"Q364+1","v":62},63,64,65,66,67,68,69,70,71,72,73,74,75,76,77,78,79,80,81,82,83,84,85,86,87,88,89,90,91,92,93,{"$f":"AW364+1","v":94},95,96,97,98,99,100,101,102,103,104,105,106,107,108,109,110,111,112,113,114,115,116,117,118,119,120,121,122,123,124,125,{"$f":"CC364+1","v":126},127,128,129,130,131,132,133,134,135,136,137,138,139,140,141,142,143,144,145,146,147,148,149,150,151,152,153,154,155,156,157,158,159,160,161,162]
[null,null,"iq","m","mllf","nvoc","nvtable","pc","psim","rd","rdig","ro","rod","rop","s","sip"]
[]
[null,null,"Recall    Designs","Word     Def.","Pattern Con.","        Matrices","              Simil.","Seq. & Quant.","Recall   Digits","Recall    Objects","Recall    Objects delayed","Speed of Info. Process.","Verbal Cluster:","Nonverbal Reasoning:","Spatial Cluster:","GCA:"]
[null,null,42,37,50,38,49,47,42,59,52,null,{"$f":"C25","v":0},{"$f":"C26","v":0},{"$f":"C27","v":0},{"$f":"C28","v":"RObI"}]
["gca",null,null,null,null,null,null,null,null,null,null,null,null,null,null,null,"snvc","Sptable","sq","vc","vtable","wd"]
[]
["Age",null,null,null,null,null,null,null,null,null,null,null,null,null,null,null,"v%","NV%","S%","GCA%","vi","nvi","si","gcai"]
[{"$f":"H4","v":0},null,null,null,null,null,null,null,null,null,null,null,null,null,null,null,{"$f":"E25","v":0},{"$f":"E26","v":0},{"$f":"E27","v":0},{"$f":"E28","v":0},{"$f":"G25","v":0},{"$f":"G26","v":0},{"$f":"G27","v":0},{"$f":"G28","v":0}]

{"sheet":"Shared Abilities EY","index":3,"n_rows":172,"n_cols":27,"rows_kept":172,"cut":false,"hidden":false,"merged":[[0,0,1,8],[4,0,4,1],[2,0,3,1],[2,2,3,8]]}
["Note: Shared Ability Standard Scores (SS) are computed only when all the subtests in the shared ability are administered. The Shared Ability subtest designation of High, Low, +, - , and = are given only if there is an appropriate mean score available."]
[]
["Early Years Shared Ability",null,"Shared Ability Subtests (includes out-of-level subtests) "]
[]
[]
["Verbal Conceptualization ",null,"VC","NV","ENC"]
[{"$f":"\"SS = \"&AA114","v":"SS = 108"},null,{"$f":"G155","v":"-"},{"$f":"G156","v":"+"},{"$f":"G166","v":"-"}]
[]
["Formulation and Testing of Hypotheses ",null,"VC","PS","PC","Mat"]
[{"$f":"\"SS = \"&AA115","v":"SS = 110"},null,{"$f":"G155","v":"-"},{"$f":"G157","v":"+"},{"$f":"G159","v":"Low"},{"$f":"G158","v":"High"}]
[]
["Use of Verbal Mediation to Solve Nonverbal Problems",null,"PS","PC","Mat"]
[{"$f":"\"SS = \"&AA116","v":"SS = 109"},null,{"$f":"G157","v":"+"},{"$f":"G159","v":"Low"},{"$f":"G158","v":"High"}]
[]
["Verbal Comprehension:",null,"VC","ENC","RSO"]
[{"$f":"\"SS = \"&AA117","v":"SS = "},null,{"$f":"G155","v":"-"},{"$f":"G166","v":"-"},{"$f":"G169","v":""}]
[]
["Verbal Expression:",null,"NV","ROi ","RDf","RSO","RDb","PhP","RN"]
[{"$f":"\"SS = \"&AA118","v":"SS = "},null,{"$f":"G156","v":"+"},{"$f":"G162","v":"-"},{"$f":"G164","v":"-"},{"$f":"G169","v":""},{"$f":"G170","v":""},{"$f":"G168","v":""},{"$f":"G172","v":""}]
[]
["Visual Analysis of Pictures:",null,"VC","PS","Mat","ROi","RPic"]
[{"$f":"\"SS = \"&AA119","v":"SS = 109"},null,{"$f":"G155","v":"-"},{"$f":"G157","v":"+"},{"$f":"G158","v":"High"},{"$f":"G162","v":"-"},{"$f":"G165","v":"-"}]
[]
["Visual Analysis of Figures or Designs:",null,"PS","PC","Mat","Copy","MLLF"]
[{"$f":"\"SS = \"&AA120","v":"SS = 105"},null,{"$f":"G157","v":"+"},{"$f":"G159","v":"Low"},{"$f":"G158","v":"High"},{"$f":"G160","v":"-"},{"$f":"G167","v":"-"}]
[]
["Spatial Visualization and Orientation:",null,"PC","Copy","MLLF"]
[{"$f":"\"SS = \"&AA121","v":"SS = 96"},null,{"$f":"G159","v":"Low"},{"$f":"G160","v":"-"},{"$f":"G167","v":"-"}]
[]
["Visual Verbal Integration:",null,"PS","Mat","ROi","RSO"]
[{"$f":"\"SS = \"&AA122","v":"SS = "},null,{"$f":"G157","v":"+"},{"$f":"G158","v":"High"},{"$f":"G162","v":"-"},{"$f":"G169","v":""}]
[]
["Short-term Memory: (general):",null,"ROi","RDf","RPic","RSO","RDb"]
[{"$f":"\"SS = \"&AA123","v":"SS = "},null,{"$f":"G162","v":"-"},{"$f":"G164","v":"-"},{"$f":"G165","v":"-"},{"$f":"G169","v":""},{"$f":"G170","v":""}]
[]
["Auditory Short-term Memory:",null,"RDf","RSO","RDb"]
[{"$f":"\"SS = \"&AA124","v":"SS = "},null,{"$f":"G164","v":"-"},{"$f":"G169","v":""},{"$f":"G170","v":""}]
[]
["Visual Short-term Memory:",null,"ROi","RPic"]
[{"$f":"\"SS = \"&AA125","v":"SS = 99"},null,{"$f":"G162","v":"-"},{"$f":"G165","v":"-"}]
[]
["Verbal Long-term Information Retrieval:",null,"NV","ENC","RN"]
[{"$f":"\"SS = \"&AA126","v":"SS = "},null,{"$f":"G155","v":"-"},{"$f":"G166","v":"-"},{"$f":"G172","v":""}]
[]
["Visual/holistic Information Processing:",null,"PS","PC","Mat","Copy","RPic","MLLF"]
[{"$f":"\"SS = \"&AA127","v":"SS = 103"},null,{"$f":"G157","v":"+"},{"$f":"G159","v":"Low"},{"$f":"G158","v":"High"},{"$f":"G160","v":"-"},{"$f":"G165","v":"-"},{"$f":"G167","v":"-"}]
[]
["Sequential Information Processing:",null,"VC","ROi","RDf","RSO","SIP","RDb","RN"]
[{"$f":"\"SS = \"&AA128","v":"SS = "},null,{"$f":"G155","v":"-"},{"$f":"G162","v":"-"},{"$f":"G164","v":"-"},{"$f":"G169","v":""},{"$f":"G171","v":""},{"$f":"G170","v":""},{"$f":"G172","v":""}]
[]
[]
[]
[]
[]
[]
[]
[]
[]
[]
[]
[]
[]
[]
[]
[]
[]
[]
[]
[]
[]
[]
[]
[]
[]
[]
[]
[]
[]
[]
[]
[]
[]
[]
[]
[]
[]
[]
[]
[]
[]
[]
[]
[]
[]
[]
[]
[]
[]
[]
[]
[]
[]
[]
[]
[]
[]
[]
[]
[]
[]
[]
[]
[]
[{"$f":"Q114","v":"Verbal Conceptualization"},null,{"$f":"Y114","v":107.87},null,null,null,null,null,null,null,null,null,null,null,{"$f":"'Record form Early Years'!U128","v":"Verbal Comprehension (Gc)"},null,"Verbal Conceptualization",{"$f":"IF(C155=\"\",0,1)","v":1},{"$f":"'Record form Early Years'!Y128","v":"VC, NV, ENC"},{"$f":"C155+C156+C166","v":163},{"$f":"R114+R115+R125","v":3},{"$f":"IF(U114<3,\"\",T114)","v":163},{"$f":"'Record form Early Years'!AA128","v":0.6},{"$f":"'Record form Early Years'!AB128","v":10.07},{"$f":"IF(V114=\"\",\"\",W114*V114+X114)","v":107.87},{"$f":"'Record form Early Years'!AD128","v":8.11},{"$f":"IF(Y114=\"\",\"\",ROUND(Y114,0))","v":108}]
["Formulation and Testing of Hypotheses",null,110.16000000000001,null,null,null,null,null,null,null,null,null,null,null,{"$f":"'Record form Early Years'!U129","v":"Naming Vocabulary (Gc)"},null,"Formulation and Testing of Hypotheses",1,{"$f":"'Record form Early Years'!Y129","v":"VC, PS, PC, Mat"},{"$f":"C155+C159+C158+C157","v":218},{"$f":"R114+R118+R117+R116","v":4},{"$f":"IF(U115<4,\"\",T115)","v":218},{"$f":"'Record form Early Years'!AA129","v":0.51},{"$f":"'Record form Early Years'!AB129","v":-1.02},110.16000000000001,{"$f":"'Record form Early Years'!AD129","v":7.53},110]
["Use of Verbal Mediation to Solve Nonverbal Problems",null,109.13000000000001,null,null,null,null,null,null,null,null,null,null,null,{"$f":"'Record form Early Years'!U130","v":"Picture Similarities (Gf)"},null,"Use of Verbal Mediation to Solve Nonverbal Problems",1,{"$f":"'Record form Early Years'!Y130","v":"PS, PC, Mat"},{"$f":"C157+C158+C159","v":165},{"$f":"R116+R117+R118","v":3},{"$f":"IF(U116<3,\"\",T116)","v":165},{"$f":"'Record form Early Years'!AA130","v":0.64},{"$f":"'Record form Early Years'!AB130","v":3.53},109.13000000000001,{"$f":"'Record form Early Years'!AD130","v":8.19},109]
["Verbal Comprehension:",null,"",null,null,null,null,null,null,null,null,null,null,null,{"$f":"'Record form Early Years'!U131","v":"Matrices (Gf)"},null,"Verbal Comprehension:",1,{"$f":"'Record form Early Years'!Y131","v":"VC, ENC, RSO"},{"$f":"C155+C166+C169","v":{"$error":"#VALUE!"}},{"$f":"R114+R125+R128","v":2},{"$f":"IF(U117<3,\"\",T117)","v":""},{"$f":"'Record form Early Years'!AA131","v":0.64},{"$f":"'Record form Early Years'!AB131","v":4.2300000000000004},"",{"$f":"'Record form Early Years'!AD131","v":7.78},""]
["Verbal Expression:",null,"",null,null,null,null,null,null,null,null,null,null,null,{"$f":"'Record form Early Years'!U132","v":"Pattern Construction (Gv)"},null,"Verbal Expression:",1,{"$f":"'Record form Early Years'!Y132","v":"NV, ROi , RDf, RSO, RDb, PhP, RN"},{"$f":"C156+C164+C169+C162+C170+C171+C172","v":{"$error":"#VALUE!"}},{"$f":"R115+R123+R128+R121+R129+R130+R131","v":3},{"$f":"IF(U118<7,\"\",T118)","v":""},{"$f":"'Record form Early Years'!AA132","v":0.32},{"$f":"'Record form Early Years'!AB132","v":-12.96},"",{"$f":"'Record form Early Years'!AD132","v":6.2},""]
["Visual Analysis of Pictures:",null,109.03999999999999,null,null,null,null,null,null,null,null,null,null,null,{"$f":"'Record form Early Years'!U133","v":"Copying (Gv)"},null,"Visual Analysis of Pictures:",1,{"$f":"'Record form Early Years'!Y133","v":"VC, PS, Mat, ROi, RPic"},{"$f":"C155+C158+C162+C157+C165","v":271},{"$f":"R114+R117+R121+R116+R124","v":5},{"$f":"IF(U119<5,\"\",T119)","v":271},{"$f":"'Record form Early Years'!AA133","v":0.44},{"$f":"'Record form Early Years'!AB133","v":-10.199999999999999},109.03999999999999,{"$f":"'Record form Early Years'!AD133","v":8.48},109]
["Visual Analysis of Figures or Designs:",null,104.85,null,null,null,null,null,null,null,null,null,null,null,null,null,"Visual Analysis of Figures or Designs:",0,{"$f":"'Record form Early Years'!Y134","v":"PSim, PC, Mat, Copy, MLLF"},{"$f":"C157+C158+C160+C159+C167","v":263},{"$f":"R116+R117+R119+R118+R126","v":5},{"$f":"IF(U120<5,\"\",T120)","v":263},{"$f":"'Record form Early Years'!AA134","v":0.41},{"$f":"'Record form Early Years'!AB134","v":-2.98},104.85,{"$f":"'Record form Early Years'!AD134","v":6.68},105]
["Spatial Visualization and Orientation:",null,96.49,null,null,null,null,null,null,null,null,null,null,null,{"$f":"'Record form Early Years'!U135","v":"Recall of Objects-Immediate (Glr)"},null,"Spatial Visualization and Orientation:",1,{"$f":"'Record form Early Years'!Y135","v":"PC, Copy, MLLF"},{"$f":"C159+C160+C167","v":144},{"$f":"R118+R119+R126","v":3},{"$f":"IF(U121<3,\"\",T121)","v":144},{"$f":"'Record form Early Years'!AA135","v":0.62},{"$f":"'Record form Early Years'!AB135","v":7.21},96.49,{"$f":"'Record form Early Years'!AD135","v":6.73},96]
["Visual Verbal Integration:",null,"",null,null,null,null,null,null,null,null,null,null,null,{"$f":"'Record form Early Years'!U136","v":"Recall of Objects-Delayed (Glr)"},null,"Visual Verbal Integration:",0,{"$f":"'Record form Early Years'!Y136","v":"PSim, Mat, ROi, RSO"},{"$f":"C157+C162+C169+C158","v":{"$error":"#VALUE!"}},{"$f":"R116+R121+R128+R117","v":3},{"$f":"IF(U122<4,\"\",T122)","v":""},{"$f":"'Record form Early Years'!AA136","v":0.57999999999999996},{"$f":"'Record form Early Years'!AB136","v":-16.420000000000002},"",{"$f":"'Record form Early Years'!AD136","v":9.48},""]
["Short-term Memory: (general):",null,"",null,null,null,null,null,null,null,null,null,null,null,{"$f":"'Record form Early Years'!U137","v":"Recall of Digits Forward (Gsm)"},null,"Short-term Memory: (general):",1,{"$f":"'Record form Early Years'!Y137","v":"ROi, RDf, RPic, RSO, RDb"},{"$f":"C162+C165+C169+C164+C170","v":{"$error":"#VALUE!"}},{"$f":"R121+R124+R128+R123+R129","v":3},{"$f":"IF(U123<5,\"\",T123)","v":""},{"$f":"'Record form Early Years'!AA137","v":0.44},{"$f":"'Record form Early Years'!AB137","v":-10.97},"",{"$f":"'Record form Early Years'!AD137","v":7.5},""]
["Auditory Short-term Memory:",null,"",null,null,null,null,null,null,null,null,null,null,null,{"$f":"'Record form Early Years'!U138","v":"Recognition of Pictures (Gv)"},null,"Auditory Short-term Memory:",1,{"$f":"'Record form Early Years'!Y138","v":"RDf, RSO, RDb,"},{"$f":"C164+C169+C170","v":{"$error":"#VALUE!"}},{"$f":"R123+R128+R129","v":1},{"$f":"IF(U124<3,\"\",T124)","v":""},{"$f":"'Record form Early Years'!AA138","v":0.68},{"$f":"'Record form Early Years'!AB138","v":-1.44},"",{"$f":"'Record form Early Years'!AD138","v":7.4},""]
["Visual Short-term Memory:",null,98.800000000000011,null,null,null,null,null,null,null,null,null,null,null,{"$f":"'Record form Early Years'!U139","v":"Early Number Concepts"},null,"Visual Short-term Memory:",1,{"$f":"'Record form Early Years'!Y139","v":"ROi, RPic"},{"$f":"C162+C165","v":99},{"$f":"R121+R124","v":2},{"$f":"IF(U125<2,\"\",T125)","v":99},{"$f":"'Record form Early Years'!AA139","v":0.91},{"$f":"'Record form Early Years'!AB139","v":8.7100000000000009},98.800000000000011,{"$f":"'Record form Early Years'!AD139","v":11.76},99]
["Verbal Long-term Information Retrieval:",null,"",null,null,null,null,null,null,null,null,null,null,null,{"$f":"'Record form Early Years'!U140","v":"Matching Letter-like Forms"},null,"Verbal Long-term Information Retrieval:",1,{"$f":"'Record form Early Years'!Y140","v":"NV, ENC, RN"},{"$f":"C156+C166+C172","v":{"$error":"#VALUE!"}},{"$f":"R115+R125+R131","v":2},{"$f":"IF(U126<3,\"\",T126)","v":""},{"$f":"'Record form Early Years'!AA140","v":0.69},{"$f":"'Record form Early Years'!AB140","v":-2.91},"",{"$f":"'Record form Early Years'!AD140","v":9.56},""]
["Visual/holistic Information Processing:",null,102.73,null,null,null,null,null,null,null,null,null,null,null,{"$f":"'Record form Early Years'!U141","v":"Phonological Processing (Ga)"},null,"Visual/holistic Information Processing:",0,{"$f":"'Record form Early Years'!Y141","v":"PSim, PC, Mat, Copy, RPic, MLLF"},{"$f":"C157+C158+C160+C159+C165+C167","v":310},{"$f":"R116+R117+R119+R118+R124+R126","v":6},{"$f":"IF(U127<6,\"\",T127)","v":310},{"$f":"'Record form Early Years'!AA141","v":0.35},{"$f":"'Record form Early Years'!AB141","v":-5.77},102.73,{"$f":"'Record form Early Years'!AD141","v":6.54},103]
["Sequential Information Processing:",null,"",null,null,null,null,null,null,null,null,null,null,null,{"$f":"'Record form Early Years'!U142","v":"Recall of Sequential Order (Gsm)"},null,"Sequential Information Processing:",0,{"$f":"'Record form Early Years'!Y142","v":"VC, ROi, RDf, RSO, SIP, RDb, RN"},{"$f":"C155+C164+C169+C162+C171+C170+C172","v":{"$error":"#VALUE!"}},{"$f":"R114+R123+R128+R121+R130+R129+R131","v":3},{"$f":"IF(U128<7,\"\",T128)","v":""},{"$f":"'Record form Early Years'!AA142","v":0.33},{"$f":"'Record form Early Years'!AB142","v":-16.350000000000001},"",{"$f":"'Record form Early Years'!AD142","v":6.46},""]
[null,null,null,null,null,null,null,null,null,null,null,null,null,null,{"$f":"'Record form Early Years'!U143","v":"Recall of Digits Backward (Gsm)"},null,null,0]
[null,null,null,null,null,null,null,null,null,null,null,null,null,null,{"$f":"'Record form Early Years'!U144","v":"Speed of Information Processing (Gs)"},null,null,0,null,"sum sub",null,null,"n to use"]
[null,null,null,null,null,null,null,null,null,null,null,null,null,null,{"$f":"'Record form Early Years'!U145","v":"Rapid Naming (Gs)"},null,null,0,null,null,null,null,{"$f":"IF(SUM(Q132+Q134+Q136+Q133)<4,\"\",T115)","v":""},{"$f":"IF(W131=\"\",\"\",W131*AC131+AD131)","v":""},{"$f":"IF(T115=\"\",\"\",100+(AE131*(X131-100)))","v":{"$error":"#VALUE!"}}]
[]
[]
[]
[]
[]
[]
[]
[]
[]
[]
[]
[]
[]
[]
[]
[]
[]
[]
[]
[]
[]
[null,null,{"$f":"IF('Record form Early Years'!F79=\"\",\"\",'Record form Early Years'!F79)","v":55}]
[null,null,null,null,null,null,"choice"]
[{"$f":"'Record form Early Years'!E81","v":"Verbal Comprehension (Gc)"},null,{"$f":"'Record form Early Years'!V128","v":53},{"$f":"'Record form Early Years'!J81","v":-2},{"$f":"IF(OR(mctyn=\"\",D155=\"\"),\"\",IF(D155<0,\"-\",IF(D155>0,\"+\",\"=\")))","v":"-"},{"$f":"'Record form Early Years'!L81","v":""},{"$f":"IF(F155=\"High\",F155,IF(F155=\"Low\",F155,E155))","v":"-"}]
[{"$f":"'Record form Early Years'!E82","v":"Naming Vocabulary (Gc)"},null,{"$f":"'Record form Early Years'!V129","v":62},{"$f":"'Record form Early Years'!J82","v":7},"+",{"$f":"'Record form Early Years'!L82","v":""},"+"]
[{"$f":"'Record form Early Years'!E83","v":"Picture Similarities (Gf)"},null,{"$f":"'Record form Early Years'!V130","v":56},{"$f":"'Record form Early Years'!J83","v":1},"+",{"$f":"'Record form Early Years'!L83","v":""},"+"]
[{"$f":"'Record form Early Years'!E84","v":"Matrices (Gf)"},null,{"$f":"'Record form Early Years'!V131","v":63},{"$f":"'Record form Early Years'!J84","v":8},"+",{"$f":"'Record form Early Years'!L84","v":"High"},"High"]
[{"$f":"'Record form Early Years'!E85","v":"Pattern Construction (Gv)"},null,{"$f":"'Record form Early Years'!V132","v":46},{"$f":"'Record form Early Years'!J85","v":-9},"-",{"$f":"'Record form Early Years'!L85","v":"Low"},"Low"]
[{"$f":"'Record form Early Years'!E86","v":"Copying (Gv)"},null,{"$f":"'Record form Early Years'!V133","v":49},{"$f":"'Record form Early Years'!J86","v":-6},"-",{"$f":"'Record form Early Years'!L86","v":""},"-"]
[null,null,null,null,""]
[{"$f":"'Record form Early Years'!E88","v":"Recall of Objects-Immediate (Glr)"},null,{"$f":"'Record form Early Years'!V135","v":52},{"$f":"'Record form Early Years'!J88","v":-3},"-",{"$f":"'Record form Early Years'!L88","v":""},{"$f":"IF(F162=\"High\",F162,IF(F162=\"Low\",F162,E162))","v":"-"}]
[{"$f":"'Record form Early Years'!E89","v":"Recall of Objects-Delayed (Glr)"},null,{"$f":"'Record form Early Years'!V136","v":""},{"$f":"'Record form Early Years'!J89","v":0},"=",{"$f":"'Record form Early Years'!L89","v":""},"="]
[{"$f":"'Record form Early Years'!E90","v":"Recall of Digits Forward (Gsm)"},null,{"$f":"'Record form Early Years'!V137","v":50},{"$f":"'Record form Early Years'!J90","v":-5},"-",{"$f":"'Record form Early Years'!L90","v":""},"-"]
[{"$f":"'Record form Early Years'!E91","v":"Recognition of Pictures (Gv)"},null,{"$f":"'Record form Early Years'!V138","v":47},{"$f":"'Record form Early Years'!J91","v":-6},"-",{"$f":"'Record form Early Years'!L91","v":""},"-"]
[{"$f":"'Record form Early Years'!E92","v":"Early Number Concepts (Gc/Gf)"},null,{"$f":"'Record form Early Years'!V139","v":48},{"$f":"'Record form Early Years'!J92","v":-7},"-",{"$f":"'Record form Early Years'!L92","v":""},"-"]
[{"$f":"'Record form Early Years'!E93","v":"Matching Letter Like Forms (Gv)"},null,{"$f":"'Record form Early Years'!V140","v":49},{"$f":"'Record form Early Years'!J93","v":-6},"-",{"$f":"'Record form Early Years'!L93","v":""},"-"]
[{"$f":"'Record form Early Years'!E94","v":"Phonological Processing (Ga)"},null,{"$f":"'Record form Early Years'!V141","v":""},{"$f":"'Record form Early Years'!J94","v":""},"",{"$f":"'Record form Early Years'!L94","v":""},""]
[{"$f":"'Record form Early Years'!E95","v":"Recall of Sequential Order (Gsm)"},null,{"$f":"'Record form Early Years'!V142","v":""},{"$f":"'Record form Early Years'!J95","v":""},"",{"$f":"'Record form Early Years'!L95","v":""},""]
[{"$f":"'Record form Early Years'!E96","v":"Recall of Digits Backward (Gsm)"},null,{"$f":"'Record form Early Years'!V143","v":""},{"$f":"'Record form Early Years'!J96","v":""},"",{"$f":"'Record form Early Years'!L96","v":""},""]
[{"$f":"'Record form Early Years'!E97","v":"Speed of Information Processing (Gs)"},null,{"$f":"'Record form Early Years'!V144","v":""},{"$f":"'Record form Early Years'!J97","v":""},"",{"$f":"'Record form Early Years'!L97","v":""},""]
[{"$f":"'Record form Early Years'!E98","v":"Rapid Naming (Gs)"},null,{"$f":"'Record form Early Years'!V145","v":""},{"$f":"'Record form Early Years'!J98","v":""},"",{"$f":"'Record form Early Years'!L98","v":""},""]

{"sheet":"DAS-II UEY Summary","index":4,"n_rows":87,"n_cols":31,"rows_kept":87,"cut":false,"hidden":false,"merged":[[0,0,1,0],[0,1,1,1],[0,2,1,2],[0,3,1,5],[39,3,39,4],[50,3,50,5],[51,1,51,3],[52,0,52,1],[52,3,52,5],[53,0,53,1],[53,3,53,5],[54,0,54,1],[54,3,54,5],[55,0,55,1],[55,3,55,5],[56,0,56,1],[56,3,56,5],[57,0,57,1],[57,3,57,5],[58,0,58,1],[58,3,58,5],[59,0,59,1],[59,3,59,5],[60,0,60,1],[60,3,60,5],[61,0,61,1],[61,3,61,5],[62,0,62,1],[62,3,62,5],[63,0,63,1],[63,3,63,5],[64,0,64,1],[64,3,64,5],[68,2,68,5],[70,2,71,5],[72,2,73,5],[74,2,75,5],[84,2,85,5],[86,2,87,5],[65,0,65,1],[66,0,66,1],[65,3,65,5],[66,3,66,5],[76,2,77,5],[78,2,79,5],[80,2,81,5],[82,2,83,5]]}
[{"$f":"'Record form School-age'!B2","v":"Name: "},{"$f":"'Input page Early Years'!D2","v":"A D"},{"$f":"'Record form School-age'!B3","v":"Age:"},{"$f":"'Input page Early Years'!J3","v":"4 years, 6 months, 0 days"}]
[]
[null,"Composite/Cluster","Score",{"$f":"CHOOSE(btwcl,\"85% confidence\",\"90% confidence\", \"95% confidence\")","v":"90% confidence"},"PR","Classification"]
[null,"General Conceptual Ability (GCA):",{"$f":"'Record form Early Years'!gca","v":111},{"$f":"'Record form Early Years'!L19","v":"104 to 117"},{"$f":"IF(C4=\"\",\"\",'Record form Early Years'!L18&\" PR\")","v":"77 PR"},{"$f":"IF(C4=\"\",\"\",LOOKUP(C4,ssname))","v":"Above average"}]
[null,"Special Nonverbal Composite (SNC):",{"$f":"'Record form Early Years'!snc","v":107},{"$f":"'Record form Early Years'!N19","v":"100 to 113"},{"$f":"IF(C5=\"\",\"\",'Record form Early Years'!N18&\" PR\")","v":"68 PR"},{"$f":"IF(C5=\"\",\"\",LOOKUP(C5,ssname))","v":"Average"}]
[null,"Verbal (V):",{"$f":"'Record form Early Years'!verb","v":113},{"$f":"'Record form Early Years'!F19","v":"103 to 121"},{"$f":"IF(C6=\"\",\"\",'Record form Early Years'!F18&\" PR\")","v":"81 PR"},"Above average"]
[null,"Nonverbal Reasoning (NVR):",{"$f":"'Record form Early Years'!nverb","v":117},{"$f":"'Record form Early Years'!H19","v":"106 to 124"},{"$f":"IF(C7=\"\",\"\",'Record form Early Years'!H18&\" PR\")","v":"87 PR"},"Above average"]
[null,"Spatial (Sp):",{"$f":"'Record form Early Years'!sp","v":95},{"$f":"'Record form Early Years'!J19","v":"89 to 102"},{"$f":"IF(C8=\"\",\"\",'Record form Early Years'!J18&\" PR\")","v":"37 PR"},"Average"]
[null,"Working Memory (WM):",{"$f":"'Record form Early Years'!wm","v":""},{"$f":"'Record form Early Years'!F44","v":""},{"$f":"IF(C9=\"\",\"\",'Record form Early Years'!F43&\" PR\")","v":""},""]
[null,"Processing Speed (PS):",{"$f":"'Record form Early Years'!ps","v":""},{"$f":"'Record form Early Years'!H44","v":""},{"$f":"IF(C10=\"\",\"\",'Record form Early Years'!H43&\" PR\")","v":""},""]
[null,"School Readiness (SchR):",{"$f":"'Record form Early Years'!sr","v":""},{"$f":"'Record form Early Years'!J44","v":""},{"$f":"IF(C11=\"\",\"\",'Record form Early Years'!J43&\" PR\")","v":""},""]
[null,"Between Clusters","Difference","Significant","Base rate"]
[null,{"$f":"\"     V ( \"&C6&\" ) vs. NVR ( \"&C7&\" ):   \"","v":"     V ( 113 ) vs. NVR ( 117 ):   "},{"$f":"'Record form Early Years'!H52","v":-4},{"$f":"'Record form Early Years'!F20","v":""},{"$f":"IF(C13=\"\",\"\",'Record form Early Years'!L52)","v":">15%"}]
[null,{"$f":"\"     V ( \"&C6&\" ) vs. Sp ( \"&C8&\" ):   \"","v":"     V ( 113 ) vs. Sp ( 95 ):   "},{"$f":"'Record form Early Years'!H54","v":18},{"$f":"'Record form Early Years'!J20","v":"V > Sp"},{"$f":"IF(C14=\"\",\"\",'Record form Early Years'!L53)","v":"10%"}]
[null,{"$f":"\"     NVR ( \"&C7&\" ) vs. Sp ( \"&C8&\" ):   \"","v":"     NVR ( 117 ) vs. Sp ( 95 ):   "},{"$f":"'Record form Early Years'!H53","v":22},{"$f":"'Record form Early Years'!H20","v":"NVR > Sp"},{"$f":"IF(C15=\"\",\"\",'Record form Early Years'!L54)","v":"15%"}]
[null,{"$f":"\"     GCA ( \"&C4&\" ) vs. WM ( \"&C9&\" ):   \"","v":"     GCA ( 111 ) vs. WM (  ):   "},{"$f":"IF(OR(C4=\"\",C9=\"\"),\"\",C4-C9)","v":""},{"$f":"'Record form Early Years'!F45","v":""},{"$f":"IF(C16=\"\",\"\",'Record form Early Years'!L55)","v":""}]
[null,{"$f":"\"     GCA ( \"&C4&\" ) vs. PS ( \"&C10&\" ):   \"","v":"     GCA ( 111 ) vs. PS (  ):   "},{"$f":"IF(OR(C4=\"\",C10=\"\"),\"\",C4-C10)","v":""},{"$f":"'Record form Early Years'!H45","v":""},{"$f":"IF(C17=\"\",\"\",'Record form Early Years'!L56)","v":""}]
[null,{"$f":"\"     GCA ( \"&C4&\" ) vs. SchR ( \"&C11&\" ):   \"","v":"     GCA ( 111 ) vs. SchR (  ):   "},{"$f":"IF(OR(C4=\"\",C11=\"\"),\"\",C4-C11)","v":""},{"$f":"'Record form Early Years'!J45","v":""},{"$f":"IF(C18=\"\",\"\",'Record form Early Years'!L57)","v":""}]
[null,{"$f":"\"     WM ( \"&C9&\" ) vs. PS( \"&C10&\" ):   \"","v":"     WM (  ) vs. PS(  ):   "},{"$f":"'Record form Early Years'!H58","v":""},{"$f":"'Record form Early Years'!F46","v":""},{"$f":"IF(C19=\"\",\"\",'Record form Early Years'!L58)","v":""}]
[null,{"$f":"\"     WM ( \"&C9&\" ) vs. SchR ( \"&C11&\" ):   \"","v":"     WM (  ) vs. SchR (  ):   "},{"$f":"'Record form Early Years'!H59","v":""},{"$f":"'Record form Early Years'!AE44","v":""},{"$f":"IF(C20=\"\",\"\",'Record form Early Years'!L59)","v":""}]
[null,{"$f":"\"     PS ( \"&C10&\" ) vs. SchR ( \"&C11&\" ):   \"","v":"     PS (  ) vs. SchR (  ):   "},{"$f":"IF(OR(C10=\"\",C11=\"\"),\"\",C10-C11)","v":""},{"$f":"'Record form Early Years'!AH44","v":""},{"$f":"IF(C21=\"\",\"\",'Record form Early Years'!L60)","v":""}]
["Cluster","Within Clusters","Difference","Significant","Base rate"]
["Verbal",{"$f":"\"VC ( \"&'Record form Early Years'!F8&\" ) vs NV ( \"&'Record form Early Years'!F10&\" )\"","v":"VC ( 53 ) vs NV ( 62 )"},{"$f":"'Record form Early Years'!H63","v":-9},{"$f":"'Record form Early Years'!J63","v":"No"},{"$f":"'Record form Early Years'!L63","v":"15%"},{"$f":"'Record form Early Years'!F62","v":""}]
["Nonverbal Reasoning",{"$f":"IF('Input page Early Years'!T9=1,\"PSim ( \"&'Record form Early Years'!H9&\" ) vs PC ( \"&'Record form Early Years'!H11&\" )\",\"PSim ( \"&'Record form Early Years'!H9&\" ) vs Mat ( \"&'Record form Early Years'!H12&\" )\")","v":"PSim ( 56 ) vs Mat ( 63 )"},{"$f":"'Record form Early Years'!H65","v":-7},{"$f":"'Record form Early Years'!J65","v":"No"},{"$f":"'Record form Early Years'!L65","v":">15%"},{"$f":"'Record form Early Years'!F64","v":""}]
["Spatial",{"$f":"IF('Input page Early Years'!T9=1,\"\",\"PCon ( \"&'Record form Early Years'!J11&\" ) vs Copy ( \"&'Record form Early Years'!J13&\" )\")","v":"PCon ( 46 ) vs Copy ( 49 )"},{"$f":"'Record form Early Years'!H67","v":-3},{"$f":"'Record form Early Years'!J67","v":"No"},{"$f":"'Record form Early Years'!L67","v":">15%"},{"$f":"'Record form Early Years'!F66","v":""}]
["Working Memory",{"$f":"\"RSO ( \"&'Record form Early Years'!F34&\" ) vs RDb ( \"&'Record form Early Years'!F36&\" )\"","v":"RSO (  ) vs RDb (  )"},{"$f":"'Record form Early Years'!H69","v":""},{"$f":"'Record form Early Years'!J69","v":""},{"$f":"'Record form Early Years'!L69","v":""},{"$f":"'Record form Early Years'!F68","v":""}]
["Processing Speed",{"$f":"\"SIP ( \"&'Record form Early Years'!H35&\" ) vs RN ( \"&'Record form Early Years'!H38&\" )\"","v":"SIP (  ) vs RN (  )"},{"$f":"'Record form Early Years'!H71","v":""},{"$f":"'Record form Early Years'!J71","v":""},{"$f":"'Record form Early Years'!L71","v":""},{"$f":"'Record form Early Years'!F70","v":""}]
["School Readiness",{"$f":"\"ENC ( \"&'Record form Early Years'!J32&\" ) vs MLLF ( \"&'Record form Early Years'!J33&\" )\"","v":"ENC ( 48 ) vs MLLF ( 49 )"},{"$f":"'Record form Early Years'!H73","v":-1},{"$f":"'Record form Early Years'!J73","v":""},{"$f":"'Record form Early Years'!L73","v":">15%"},{"$f":"'Record form Early Years'!F72","v":""}]
[null,{"$f":"\"ENC ( \"&'Record form Early Years'!J32&\" ) vs PhP ( \"&'Record form Early Years'!J37&\" )\"","v":"ENC ( 48 ) vs PhP (  )"},{"$f":"'Record form Early Years'!H74","v":""},{"$f":"'Record form Early Years'!J74","v":""},{"$f":"'Record form Early Years'!L74","v":""}]
[null,{"$f":"\"ENC ( \"&'Record form Early Years'!J33&\" ) vs PhP ( \"&'Record form Early Years'!J37&\" )\"","v":"ENC ( 49 ) vs PhP (  )"},{"$f":"'Record form Early Years'!H75","v":""},{"$f":"'Record form Early Years'!J75","v":""},{"$f":"'Record form Early Years'!L75","v":""}]
[null,{"$f":"\"Mean Core T = \"&'Record form Early Years'!F79&\"  using  \"&'Record form Early Years'!V83","v":"Mean Core T = 55  using  GCA"},"T score","High/Low","Frequency"]
[null,{"$f":"'Record form Early Years'!E81","v":"Verbal Comprehension (Gc)"},{"$f":"'Record form Early Years'!F81","v":53},{"$f":"'Record form Early Years'!L81","v":""},{"$f":"'Record form Early Years'!N81","v":""}]
[null,{"$f":"'Record form Early Years'!E82","v":"Naming Vocabulary (Gc)"},{"$f":"'Record form Early Years'!F82","v":62},{"$f":"'Record form Early Years'!L82","v":""},{"$f":"'Record form Early Years'!N82","v":""}]
[null,{"$f":"'Record form Early Years'!E83","v":"Picture Similarities (Gf)"},{"$f":"'Record form Early Years'!F83","v":56},{"$f":"'Record form Early Years'!L83","v":""},{"$f":"'Record form Early Years'!N83","v":""}]
[null,{"$f":"'Record form Early Years'!E84","v":"Matrices (Gf)"},{"$f":"'Record form Early Years'!F84","v":63},{"$f":"'Record form Early Years'!L84","v":"High"},{"$f":"'Record form Early Years'!N84","v":"15%"}]
[null,{"$f":"'Record form Early Years'!E85","v":"Pattern Construction (Gv)"},{"$f":"'Record form Early Years'!F85","v":46},{"$f":"'Record form Early Years'!L85","v":"Low"},{"$f":"'Record form Early Years'!N85","v":"15%"}]
[null,{"$f":"'Record form Early Years'!E86","v":"Copying (Gv)"},{"$f":"'Record form Early Years'!F86","v":49},{"$f":"'Record form Early Years'!L86","v":""},{"$f":"'Record form School-age'!N75","v":"15%"}]
[]
[null,{"$f":"'Record form Early Years'!E88","v":"Recall of Objects-Immediate (Glr)"},{"$f":"'Record form Early Years'!F88","v":52},{"$f":"'Record form Early Years'!L88","v":""},{"$f":"'Record form Early Years'!N88","v":""}]
[null,{"$f":"'Record form Early Years'!E89","v":"Recall of Objects-Delayed (Glr)"},{"$f":"'Record form Early Years'!F89","v":""},{"$f":"'Record form Early Years'!L89","v":""}]
[null,{"$f":"'Record form Early Years'!E90","v":"Recall of Digits Forward (Gsm)"},{"$f":"'Record form Early Years'!F90","v":50},{"$f":"'Record form Early Years'!L90","v":""},{"$f":"'Record form Early Years'!N90","v":""}]
[null,{"$f":"'Record form Early Years'!E91","v":"Recognition of Pictures (Gv)"},{"$f":"'Record form Early Years'!F91","v":47},{"$f":"'Record form Early Years'!L91","v":""},{"$f":"'Record form Early Years'!N91","v":""}]
[null,{"$f":"'Record form Early Years'!E92","v":"Early Number Concepts (Gc/Gf)"},{"$f":"'Record form Early Years'!F92","v":48},{"$f":"'Record form Early Years'!L92","v":""},{"$f":"'Record form Early Years'!N92","v":""}]
[null,{"$f":"'Record form Early Years'!E93","v":"Matching Letter Like Forms (Gv)"},{"$f":"'Record form Early Years'!F93","v":49},{"$f":"'Record form Early Years'!L93","v":""},{"$f":"'Record form Early Years'!N93","v":""}]
[null,{"$f":"'Record form Early Years'!E94","v":"Phonological Processing (Ga)"},{"$f":"'Record form Early Years'!F94","v":""},{"$f":"'Record form Early Years'!L94","v":""},{"$f":"'Record form Early Years'!N94","v":""}]
[null,{"$f":"'Record form Early Years'!E95","v":"Recall of Sequential Order (Gsm)"},{"$f":"'Record form Early Years'!F95","v":""},{"$f":"'Record form Early Years'!L95","v":""},{"$f":"'Record form Early Years'!N95","v":""}]
[null,{"$f":"'Record form Early Years'!E96","v":"Recall of Digits Backward (Gsm)"},{"$f":"'Record form Early Years'!F96","v":""},{"$f":"'Record form Early Years'!L96","v":""},{"$f":"'Record form Early Years'!N96","v":""}]
[null,{"$f":"'Record form Early Years'!E97","v":"Speed of Information Processing (Gs)"},{"$f":"'Record form Early Years'!F97","v":""},{"$f":"'Record form Early Years'!L97","v":""},{"$f":"'Record form Early Years'!N97","v":""}]
[null,{"$f":"'Record form Early Years'!E98","v":"Rapid Naming (Gs)"},{"$f":"'Record form Early Years'!F98","v":""},{"$f":"'Record form Early Years'!L98","v":""},{"$f":"'Record form Early Years'!N98","v":""}]
[]
[null,"Early Years Shared Ability","SS","Subtests"]
[]
[{"$f":"'Shared Abilities EY'!A6","v":"Verbal Conceptualization "},null,{"$f":"'Shared Abilities EY'!AA114","v":108},"VC, NV, ENC"]
[{"$f":"'Shared Abilities EY'!A9","v":"Formulation and Testing of Hypotheses "},null,{"$f":"'Shared Abilities EY'!AA115","v":110},"VC, PS, PC, Mat"]
[{"$f":"'Shared Abilities EY'!A12","v":"Use of Verbal Mediation to Solve Nonverbal Problems"},null,{"$f":"'Shared Abilities EY'!AA116","v":109},"PS, PC, Mat"]
[{"$f":"'Shared Abilities EY'!A15","v":"Verbal Comprehension:"},null,{"$f":"'Shared Abilities EY'!AA117","v":""},"VC, ENC, RSO"]
[{"$f":"'Shared Abilities EY'!A18","v":"Verbal Expression:"},null,{"$f":"'Shared Abilities EY'!AA118","v":""},"NV, ROi , RDf, RSO, RDb, PhP, RN"]
[{"$f":"'Shared Abilities EY'!A21","v":"Visual Analysis of Pictures:"},null,{"$f":"'Shared Abilities EY'!AA119","v":109},"VC, PS, Mat, ROi, RPic"]
[{"$f":"'Shared Abilities EY'!A24","v":"Visual Analysis of Figures or Designs:"},null,{"$f":"'Shared Abilities EY'!AA120","v":105},"PS, PC, Mat, Copy, MLLF"]
[{"$f":"'Shared Abilities EY'!A27","v":"Spatial Visualization and Orientation:"},null,{"$f":"'Shared Abilities EY'!AA121","v":96},"PC, Copy, MLLF"]
[{"$f":"'Shared Abilities EY'!A30","v":"Visual Verbal Integration:"},null,{"$f":"'Shared Abilities EY'!AA122","v":""},"PS, Mat, ROi, RSO"]
[{"$f":"'Shared Abilities EY'!A33","v":"Short-term Memory: (general):"},null,{"$f":"'Shared Abilities EY'!AA123","v":""},"ROi, RDf, RPic, RSO, RDb"]
[{"$f":"'Shared Abilities EY'!A36","v":"Auditory Short-term Memory:"},null,{"$f":"'Shared Abilities EY'!AA124","v":""},"RDf, RSO, RDb,"]
[{"$f":"'Shared Abilities EY'!A39","v":"Visual Short-term Memory:"},null,{"$f":"'Shared Abilities EY'!AA125","v":99},"ROi, RPic"]
[{"$f":"'Shared Abilities EY'!A42","v":"Verbal Long-term Information Retrieval:"},null,{"$f":"'Shared Abilities EY'!AA126","v":""},"NV, ENC, RN"]
[{"$f":"'Shared Abilities EY'!A45","v":"Visual/holistic Information Processing:"},null,{"$f":"'Shared Abilities EY'!AA127","v":103},"PS, PC, Mat, Copy, RPic, MLLF"]
[{"$f":"'Shared Abilities EY'!A48","v":"Sequential Information Processing:"},null,{"$f":"'Shared Abilities EY'!AA128","v":""},"VC, ROi, RDf, RSO, SIP, RDb, RN"]
[]
["Comparison","Significance","Possible implication"]
[]
[{"$f":"\"RDf  (\"&C41&\") vs. RDb (\"&C47&\")\"","v":"RDf  (50) vs. RDb ()"},{"$f":"W71","v":""},"Non-meaningful auditory memory span versus Non-meaningful auditory working memory",null,null,null,null,null,null,null,null,null,null,{"$f":"B32","v":"Verbal Comprehension (Gc)"},53,null,{"$f":"O79","v":50},{"$f":"O85","v":""},{"$f":"IF(OR(Q71=\"\",R71=\"\"),\"\",Q71-R71)","v":""},9,{"$f":"IF(OR(Q71=\"\",R71=\"\"),\"\",IF(Q71=R71,1,IF(S71<0,2,3)))","v":""},{"$f":"IF(ABS(S71)>=T71,1,0)","v":{"$error":"#VALUE!"}},{"$f":"IF(OR(Q71=\"\",R71=\"\"),\"\",IF(V71=1,CHOOSE(U71,\"NS\",Y71,X71),\"NS\"))","v":""},"RDf > RDb ","RDf  < RDb ",null,null,null,null,null,"RDf  (55) vs. RDb (59)"]
[null,null,null,null,null,null,null,null,null,null,null,null,null,"Naming Vocabulary (Gc)",62,null,{"$f":"O79","v":50},{"$f":"O84","v":""},"",9,"",{"$error":"#VALUE!"},"","RDf > RSO","RDf < RSO",null,null,null,null,null,"RDf  (55) vs. RSO (51)"]
[{"$f":"\"RDf  (\"&C41&\") vs. RSO (\"&C46&\")\"","v":"RDf  (50) vs. RSO ()"},{"$f":"W72","v":""},"Non-meaningful auditory memory span versus Meaningful auditory/visual working memory",null,null,null,null,null,null,null,null,null,null,"Picture Similarities (Gf)",56,null,{"$f":"O79","v":50},{"$f":"O80","v":47},3,11,3,0,"NS","RDf > RPic ","RDf < RPic ",null,null,null,null,null,"RDf  (55) vs. RPic (67)"]
[null,null,null,null,null,null,null,null,null,null,null,null,null,"Matrices (Gf)",63,null,{"$f":"O85","v":""},{"$f":"O84","v":""},"",9,"",{"$error":"#VALUE!"},"","RDb > RSO","RDb < RSO",null,null,null,null,null,"RDb  (59) vs. RSO (51)"]
[{"$f":"\"RDf  (\"&C41&\") vs. RPic (\"&C42&\")\"","v":"RDf  (50) vs. RPic (47)"},{"$f":"W73","v":"NS"},"Non-meaningful auditory memory span versus Visual memory ",null,null,null,null,null,null,null,null,null,null,"Pattern Construction (Gv)",46,null,{"$f":"O77","v":52},{"$f":"O78","v":""},"",11,"",{"$error":"#VALUE!"},"","ROi > ROd","RObi < ROd",null,null,null,null,null,"ROi  (38) vs. ROd (39)"]
[null,null,null,null,null,null,null,null,null,null,null,null,null,"Copying (Gv)",49,null,{"$f":"O77","v":52},{"$f":"O79","v":50},2,11,3,0,"NS","ROi > RDf","ROi < RDf",null,null,null,null,null,"ROi  (38) vs. RDf (55)"]
[{"$f":"\"RDb  (\"&C47&\") vs. RSO (\"&C46&\")\"","v":"RDb  () vs. RSO ()"},{"$f":"W74","v":""},"Non-meaningful auditory working memory versus Meaningful auditory/visual working memory",null,null,null,null,null,null,null,null,null,null,{"$f":"B39","v":"Recall of Objects-Immediate (Glr)"},{"$f":"C39","v":52},null,{"$f":"O77","v":52},{"$f":"O85","v":""},"",12,"",{"$error":"#VALUE!"},"","ROi > RDb","ROi < RDb",null,null,null,null,null,"ROi  (38) vs. RDb (59)"]
[null,null,null,null,null,null,null,null,null,null,null,null,null,"Recall of Objects-Delayed (Glr)","",null,{"$f":"O86","v":""},{"$f":"O87","v":""},"",11,"",{"$error":"#VALUE!"},"","SIP > RN","SIP < RN",null,null,null,null,null,"SIP (57) vs. RN (67)"]
[{"$f":"\"ROi  (\"&C39&\") vs. ROd (\"&C40&\")\"","v":"ROi  (52) vs. ROd ()"},{"$f":"W75","v":""},"Meaningful visual memory immediate versus Meaningful visual memory delayed",null,null,null,null,null,null,null,null,null,null,"Recall of Digits Forward (Gsm)",50,null,{"$f":"O77","v":52},{"$f":"O87","v":""},"",13,"",{"$error":"#VALUE!"},"","ROi > RN","ROi < RN",null,null,null,null,null,"ROi (38) vs. RN (67)"]
[null,null,null,null,null,null,null,null,null,null,null,null,null,"Recognition of Pictures (Gv)",47]
[{"$f":"\"ROi  (\"&C39&\") vs. RDf (\"&C41&\")\"","v":"ROi  (52) vs. RDf (50)"},{"$f":"W76","v":"NS"},"Meaningful visual memory immediate versus Non-meaningful auditory memory  span ",null,null,null,null,null,null,null,null,null,null,"Early Number Concepts (Gc/Gf)",48]
[null,null,null,null,null,null,null,null,null,null,null,null,null,"Matching Letter Like Forms (Gv)",49]
[{"$f":"\"ROi  (\"&C39&\") vs. RDb (\"&C47&\")\"","v":"ROi  (52) vs. RDb ()"},{"$f":"W77","v":""},"Meaningful visual memory versus Non-meaningful auditory working memory",null,null,null,null,null,null,null,null,null,null,"Phonological Processing (Ga)",""]
[null,null,null,null,null,null,null,null,null,null,null,null,null,"Recall of Sequential Order (Gsm)",""]
[{"$f":"\"SIP (\"&C48&\") vs. RN (\"&C49&\")\"","v":"SIP () vs. RN ()"},{"$f":"W78","v":""},"Processing Speed Cluster: If significant difference is evidenced, examine ROi vs. RN comparison",null,null,null,null,null,null,null,null,null,null,"Recall of Digits Backward (Gsm)",""]
[null,null,null,null,null,null,null,null,null,null,null,null,null,"Speed of Information Processing (Gs)",""]
[{"$f":"\"ROi (\"&C39&\") vs. RN (\"&C49&\")\"","v":"ROi (52) vs. RN ()"},{"$f":"W79","v":""},"* Make this comparison only if the SIP vs. RN is significant. RN could involve Glr",null,null,null,null,null,null,null,null,null,null,"Rapid Naming (Gs)",""]

{"sheet":"Input page School-age","index":5,"n_rows":57,"n_cols":28,"rows_kept":57,"cut":false,"hidden":false,"merged":[[1,3,1,7],[30,3,31,3],[33,1,33,2],[5,1,6,2],[13,1,14,2],[13,11,14,11],[32,1,32,2],[36,7,37,7],[36,9,37,9],[34,1,34,2],[13,13,14,13],[5,7,6,7],[13,3,14,3],[13,5,14,5],[13,7,14,7],[13,9,14,9],[49,3,50,3],[45,1,45,2],[36,1,36,2],[36,11,37,11],[36,13,37,13],[15,1,15,2],[16,1,16,2],[17,1,17,2],[18,1,18,2],[19,1,19,2]]}
[]
[null,"Name: ",null,"C C",null,null,null,null,null,null,null,null,null,null,null,null,null,null,null,{"$f":"YEAR(D3)","v":2009},{"$f":"MONTH(D3)","v":2},{"$f":"DAY(D3)","v":26},{"$f":"IF(X3>Y2,T2-1,T2)","v":2008},{"$f":"IF(X3>Y2,Y2+12,Y2)","v":14},{"$f":"IF(Z3>V2,U2-1,U2)","v":2},{"$f":"IF(Z3>V2,V2+30,V2)","v":26}]
[null,"Date of Test:",null,"2009-02-26",null,null,null,"Age:",null,{"$f":"AB4","v":"8 years, 6 months, 14 days"},null,null,null,null,null,null,null,null,null,null,null,null,{"$f":"YEAR(D4)","v":2000},{"$f":"MONTH(D4)","v":8},null,{"$f":"DAY(D4)","v":12}]
[null,"Date of Birth:",null,"2000-08-12",null,null,null,"Date Analyzed: ",null,{"$f":"NOW()","v":"2014-02-11T13:44:26.090"},null,null,null,null,null,null,null,null,null,null,null,null,{"$f":"W2-W3","v":8},{"$f":"X2-X3","v":6},null,{"$f":"Z2-Z3","v":14},null,{"$f":"W4&\" years, \"&X4&X5&Z4&Z5","v":"8 years, 6 months, 14 days"}]
[null,null,null,null,null,null,null,null,null,null,null,null,null,null,null,null,null,null,null,null,null,null,null,{"$f":"IF(X4=1,\" month, \",\" months, \")","v":" months, "},null,{"$f":"IF(Z4=1,\" day\",\" days\")","v":" days"}]
[]
[null,null,null,"T Score"]
[null,"Recall of Designs (Gv)","RDes",80]
[null,"Word Definition (Gc)","WDef",43]
[null,"Pattern Construction (Gv)","PCon",39]
[null,"Matrices (Gf)","Mat",27]
[null,"Verbal Similarities (Gc)","VSim",40]
[null,"Sequential & Quantitative Reasoning (Gf)","SQR",41]
[null,null,null,"Standard Score"]
[]
[null,"Verbal",null,100]
[null,"Nonverbal Reasoning",null,74]
[null,"Spatial",null,91]
[null,"GCA",null,80,null,null,null,null,null,null,null,null,null,null,null,null,null,null,null,2]
[null,"SNV",null,58]
[null,null,null,"T Score"]
[null,"Recall of Objects-Immediate (Glr)","RObI",59]
[null,"Recall of Objects-Delayed (Glr)","RObD",60]
[null,"Recall of Digits Forward (Gsm)","DigF",40]
[null,"Recognition of Pictures (Gv)","RPic",43]
[null,"Recall of Sequential Order (Gsm)","SeqO",37]
[null,"Speed of Information Processing (Gs)","SIP"]
[null,"Recall of Digits Backward (Gsm)","DigB",50]
[null,"Phonological Processing (Ga)","PhP",53]
[null,"Rapid Naming (Gs)","RNam",44]
[null,null,null,"Standard Score"]
[]
[null,"Working Memory",null,89]
[null,"Processing Speed"]
[null,"School Readiness"]
[]
[null,"Phonological Processing (Ga)",null,"Ability",null,"SEm"]
[null,null,"Task 1 (Rhyming)"]
[null,null,null,"Ability",null,"SEm"]
[null,null,"Task 2 (Blending)"]
[null,null,null,"Ability",null,"SEm"]
[null,null,"Task 3 (Deletion)"]
[null,null,null,"Ability",null,"SEm"]
[null,null,"Task 4 (Phoneme Identification and Segmentation)"]
[]
[null,"Rapid Naming (Gs)",null,"Ability",null,"SEm"]
[null,null,"Simple Naming"]
[null,null,null,"Ability",null,"Sem"]
[null,null,"Complex Naming"]
[null,null,null,"T Score"]
[]
[null,"Early Number Concepts (Gc/Gf)","ENC"]
[null,"Matching Letter Like Forms (Gv)","MLLF"]
[null,"Verbal Comprehension (Gc)","VCom"]
[null,"Picture Similarities (Gf)","Psim"]
[null,"Naming Vocabulary (Gc)","Nvoc"]
[null,"Copying (Gv)","Copy"]

{"sheet":"Record form School-age","index":6,"n_rows":310,"n_cols":203,"rows_kept":310,"cut":false,"hidden":false,"merged":[[187,1,187,15],[55,13,55,15],[50,2,50,5],[67,7,68,7],[45,5,45,7],[38,13,39,13],[38,1,39,3],[38,5,39,5],[38,7,39,7],[38,9,39,9],[5,19,6,19],[13,5,14,5],[13,7,14,7],[13,9,14,9],[13,11,14,11],[13,13,14,13],[5,1,6,2],[25,1,26,2],[38,11,39,11],[1,10,1,11],[2,10,2,11],[1,2,1,3],[3,10,3,11],[2,2,2,5],[13,1,14,3]]}
[]
[null,"Name: ",{"$f":"IF('Input page School-age'!D2=\"\",\"\",'Input page School-age'!D2)","v":"C C"},null,null,null,null,null,null,"Date of Test:",{"$f":"IF('Input page School-age'!D3=\"\",\"\",'Input page School-age'!D3)","v":"2009-02-26"}]
[null,"Age:",{"$f":"IF('Input page School-age'!J3=\"\",\"\",'Input page School-age'!J3)","v":"8 years, 6 months, 14 days"},null,null,null,null,null,null,"Date of Birth:",{"$f":"IF('Input page School-age'!D4=\"\",\"\",'Input page School-age'!D4)","v":"2000-08-12"}]
[null,null,null,null,null,null,null,null,null,"Date Analyzed:",{"$f":"NOW()","v":"2014-02-11T13:44:26.090"}]
[]
[null,"Core Subtest T Scores",null,null,null,"Verbal",null,"Nonverbal Reasoning",null,"Spatial",null,"GCA",null,"SNV",null,null,null,null,null,"Standard Score"]
[null,null,null,"T Score",null,"(Gc)",null,"(Gf)",null,"(Gv)",null,"(g)",null,"(g)",null,"Percentile"]
[null,"Recall of Designs (Gv)","RDes",{"$f":"IF('Input page School-age'!D8=\"\",\"\",'Input page School-age'!D8)","v":80},null,null,null,null,null,{"$f":"IF(D8=\"\",\"\",D8)","v":80},null,{"$f":"IF(D8=\"\",\"\",D8)","v":80},null,{"$f":"IF(D8=\"\",\"\",D8)","v":80},null,{"$f":"IF(D8=\"\",\"\",LOOKUP(D8,ttopr))","v":99.9},null,null,null,{"$f":"100+((D8-50)/10)*15","v":145}]
[null,"Word Definition (Gc)","WDef",{"$f":"IF('Input page School-age'!D9=\"\",\"\",'Input page School-age'!D9)","v":43},null,{"$f":"IF(D9=\"\",\"\",D9)","v":43},null,null,null,null,null,43,null,null,null,24,null,null,null,89.5]
[null,"Pattern Construction (Gv)","PCon",{"$f":"IF('Input page School-age'!D10=\"\",\"\",'Input page School-age'!D10)","v":39},null,null,null,null,null,{"$f":"IF(D10=\"\",\"\",D10)","v":39},null,39,null,{"$f":"IF(D10=\"\",\"\",D10)","v":39},null,14,null,null,null,83.5]
[null,"Matrices (Gf)","Mat",{"$f":"IF('Input page School-age'!D11=\"\",\"\",'Input page School-age'!D11)","v":27},null,null,null,{"$f":"IF(D11=\"\",\"\",D11)","v":27},null,null,null,27,null,{"$f":"IF(D11=\"\",\"\",D11)","v":27},null,1,null,null,null,65.5,null,null,{"$f":"COUNT(L8:L13)","v":6},{"$f":"COUNT(N8:N13)","v":4}]
[null,"Verbal Similarities (Gc)","VSim",{"$f":"IF('Input page School-age'!D12=\"\",\"\",'Input page School-age'!D12)","v":40},null,{"$f":"IF(D12=\"\",\"\",D12)","v":40},null,null,null,null,null,40,null,null,null,16,null,null,null,85,null,null,{"$f":"SUM(L8:L13)","v":270},{"$f":"SUM(N8:N13)","v":187}]
[null,"Sequential & Quantitative Reasoning (Gf)","SQR",{"$f":"IF('Input page School-age'!D13=\"\",\"\",'Input page School-age'!D13)","v":41},null,null,null,{"$f":"IF(D13=\"\",\"\",D13)","v":41},null,null,null,41,null,{"$f":"IF(D13=\"\",\"\",D13)","v":41},null,18,null,null,null,86.5,null,null,{"$f":"IF(W11<6,\"\",ROUND((W12/6),0))","v":45},{"$f":"IF(X11<4,\"\",ROUND((X12/4),0))","v":47}]
[null,"Cluster/Composite Scores"]
[null,null,null,null,null,null,null,null,null,null,null,null,null,null,null,null,null,null,null,null,null,2,{"$f":"IF(V15=1,90,95)","v":95}]
[null,null,null,"Sum of Core T scores",null,{"$f":"\"(\"&SUM(F9:F15)&\")\"","v":"(83)"},null,{"$f":"\"(\"&SUM(H9:H15)&\")\"","v":"(68)"},null,{"$f":"\"(\"&SUM(J8:J15)&\")\"","v":"(119)"},null,{"$f":"\"(\"&SUM(L8:L15)&\")\"","v":"(270)"},null,{"$f":"\"(\"&SUM(N8:N15)&\")\"","v":"(187)"},null,null,null,null,null,null,"v",0.89,{"$f":"100+V16*(F17-100)","v":100},{"$f":"15*SQRT((1-V16)*(V16))","v":4.6933463541486038},{"$f":"IF($W$15=90,X16*1.65,X16*1.96)","v":9.1989588541312628},{"$f":"ROUND(W16-Y16,0)","v":91},{"$f":"ROUND(W16+Y16,0)","v":109},{"$f":"SUM(F8:F13)","v":83},{"$f":"SUM(H8:H13)","v":68},{"$f":"SUM(J8:J13)","v":119},{"$f":"SUM(L8:L13)","v":270},{"$f":"SUM(N8:N13)","v":187},{"$f":"SUM(F33:F38)","v":87},{"$f":"SUM(H33:H38)","v":44},{"$f":"SUM(J32:J37)","v":53}]
[null,null,null,"Standard Score",null,{"$f":"IF('Input page School-age'!D16=\"\",\"\",'Input page School-age'!D16)","v":100},null,{"$f":"IF('Input page School-age'!D17=\"\",\"\",'Input page School-age'!D17)","v":74},null,{"$f":"IF('Input page School-age'!D18=\"\",\"\",'Input page School-age'!D18)","v":91},null,{"$f":"IF('Input page School-age'!D19=\"\",\"\",'Input page School-age'!D19)","v":80},null,{"$f":"IF('Input page School-age'!D20=\"\",\"\",'Input page School-age'!D20)","v":58},null,null,null,null,null,null,"nv",0.92,{"$f":"100+V17*(H17-100)","v":76.08},{"$f":"15*SQRT((1-V17)*(V17))","v":4.06939798987516},{"$f":"IF($W$15=90,X17*1.65,X17*1.96)","v":7.9760200601553137},{"$f":"ROUND(W17-Y17,0)","v":68},{"$f":"ROUND(W17+Y17,0)","v":84},{"$f":"LOOKUP(AB16,Vts)","v":85},{"$f":"LOOKUP(AC16,NVts)","v":74},{"$f":"LOOKUP(AD16,Spts)","v":116},{"$f":"LOOKUP(AE16,gcasum)","v":89},{"$f":"LOOKUP(AF16,gcasum)","v":65},{"$f":"LOOKUP(AG16,wmss)","v":89},{"$f":"LOOKUP(AH16,psss)","v":49},{"$f":"LOOKUP(AI16,gcasum)","v":{"$error":"#N/A"}}]
[null,null,null,"Percentile",null,{"$f":"IF(F17=\"\",\"\",LOOKUP(F17,sstopr))","v":50},null,{"$f":"IF(H17=\"\",\"\",LOOKUP(H17,sstopr))","v":4},null,{"$f":"IF(J17=\"\",\"\",LOOKUP(J17,sstopr))","v":27},null,{"$f":"IF(L17=\"\",\"\",LOOKUP(L17,sstopr))","v":9},null,{"$f":"IF(N17=\"\",\"\",LOOKUP(N17,sstopr))","v":1},null,null,null,null,null,null,"sp",0.95,{"$f":"100+V18*(J17-100)","v":91.45},{"$f":"15*SQRT((1-V18)*(V18))","v":3.2691742076555066},{"$f":"IF($W$15=90,X18*1.65,X18*1.96)","v":6.4075814470047927},{"$f":"ROUND(W18-Y18,0)","v":85},{"$f":"ROUND(W18+Y18,0)","v":98},"v","nv","sp","gca","snc","wm","ps","sr"]
[null,"Confidence Interval  ",null,null,null,{"$f":"IF(F18=\"\",\"\",Z16&\" to \"&AA16)","v":"91 to 109"},null,{"$f":"IF(H18=\"\",\"\",Z17&\" to \"&AA17)","v":"68 to 84"},null,{"$f":"IF(J18=\"\",\"\",Z18&\" to \"&AA18)","v":"85 to 98"},null,{"$f":"IF(L18=\"\",\"\",Z24&\" to \"&AA24)","v":"75 to 87"},null,{"$f":"IF(N18=\"\",\"\",Z25&\" to \"&AA25)","v":"54 to 65"},null,null,null,null,null,null,"sr",0.9,{"$f":"100+V19*(J42-100)","v":{"$error":"#VALUE!"}},{"$f":"15*SQRT((1-V19)*(V19))","v":4.5},{"$f":"IF($W$15=90,X19*1.65,X19*1.96)","v":8.82},{"$f":"ROUND(W19-Y19,0)","v":{"$error":"#VALUE!"}},{"$f":"ROUND(W19+Y19,0)","v":{"$error":"#VALUE!"}}]
[null,null,null,"Between Cluster Difference",null,{"$f":"IF(F17=\"\",\"\",V56)","v":"V > NVR"},null,{"$f":"IF(H17=\"\",\"\",V58)","v":"NVR < Sp"},null,{"$f":"IF(J17=\"\",\"\",V57)","v":"No"}]
[null,null,null,"Within Cluster Differences",null,{"$f":"IF(F17=\"\",\"\",V65)","v":"No"},null,{"$f":"IF(H17=\"\",\"\",V66)","v":"Mat < SQR"},null,{"$f":"IF(J17=\"\",\"\",V67)","v":"RDes > PC"}]
[null,null,null,"Mean Core T Score",null,null,null,null,null,null,null,{"$f":"W13","v":45},null,{"$f":"X13","v":47},null,null,null,null,null,null,"wm",0.95,{"$f":"100+V22*(F42-100)","v":89.55},{"$f":"15*SQRT((1-V22)*(V22))","v":3.2691742076555066},{"$f":"IF($W$15=90,X22*1.65,X22*1.96)","v":6.4075814470047927},{"$f":"ROUND(W22-Y22,0)","v":83},{"$f":"ROUND(W22+Y22,0)","v":96}]
[null,null,null,null,null,"Verbal",null,"Nonverbal Reasoning",null,"Spatial",null,"GCA",null,"SNV",null,null,null,null,null,null,"ps",0.9,{"$f":"100+V23*(H42-100)","v":{"$error":"#VALUE!"}},{"$f":"15*SQRT((1-V23)*(V23))","v":4.5},{"$f":"IF($W$15=90,X23*1.65,X23*1.96)","v":8.82},{"$f":"ROUND(W23-Y23,0)","v":{"$error":"#VALUE!"}},{"$f":"ROUND(W23+Y23,0)","v":{"$error":"#VALUE!"}}]
[null,null,null,null,null,"(Gc)",null,"(Gf)",null,"(Gv)",null,"(g)",null,"(g)",null,null,null,null,null,null,"gca",0.96,{"$f":"100+V24*(L17-100)","v":80.8},{"$f":"15*SQRT((1-V24)*(V24))","v":2.9393876913398151},{"$f":"IF($W$15=90,X24*1.65,X24*1.96)","v":5.7611998750260378},{"$f":"ROUND(W24-Y24,0)","v":75},{"$f":"ROUND(W24+Y24,0)","v":87}]
[null,null,null,null,null,null,null,null,null,null,null,null,null,null,null,null,null,null,null,null,"snv",0.96,{"$f":"100+V25*(N17-100)","v":59.68},{"$f":"15*SQRT((1-V25)*(V25))","v":2.9393876913398151},{"$f":"IF($W$15=90,X25*1.65,X25*1.96)","v":5.7611998750260378},{"$f":"ROUND(W25-Y25,0)","v":54},{"$f":"ROUND(W25+Y25,0)","v":65}]
[null,"Core Subtest T Scores",null,null,null,"Working Memory",null,"Processing Speed",null,"School Readiness",null,null,null,null,null,null,null,null,"Standard Score"]
[null,null,null,"T Score",null,"(Gsm)",null,"(Gs)",null,"(7:0-8:11)",null,"Percentile",null,null,null,null,null,null,null,null,"v v GCA",{"$f":"CHOOSE(btwcl, 9,13,17)","v":13},{"$f":"IF(ABS(verb-gca)>=V27,1,0)","v":1},{"$f":"verb-gca","v":20},{"$f":"IF(W27=0,\"\",IF(X27>0,\"V > GCA\",\"V < GCA\"))","v":"V > GCA"}]
[null,"Recall of Objects-Immediate (Glr)","RObI",{"$f":"IF('Input page School-age'!D22=\"\",\"\",'Input page School-age'!D22)","v":59},null,null,null,null,null,null,null,{"$f":"IF(D28=\"\",\"\",LOOKUP(D28,ttopr))","v":82},null,null,null,null,null,null,{"$f":"100+((D28-50)/10)*15","v":113.5},null,"NV v GCA",{"$f":"CHOOSE(btwcl, 9,12,16)","v":12},{"$f":"IF(ABS(nverb-gca)>=V28,1,0)","v":0},{"$f":"nverb-gca","v":-6},{"$f":"IF(W28=0,\"\",IF(X28>0,\"NV > GCA\",\"NV < GCA\"))","v":""}]
[null,"Recall of Objects-Delayed (Glr)","RObD",{"$f":"IF('Input page School-age'!D23=\"\",\"\",'Input page School-age'!D23)","v":60},null,null,null,null,null,null,null,84,null,null,null,null,null,null,115,null,"SP v GCA",{"$f":"CHOOSE(btwcl, 8,10,14)","v":10},{"$f":"IF(ABS(sp-gca)>=V29,1,0)","v":1},{"$f":"sp-gca","v":11},{"$f":"IF(W29=0,\"\",IF(X29>0,\"Sp > GCA\",\"Sp < GCA\"))","v":"Sp > GCA"}]
[null,"Recall of Digits Forward (Gsm)","DigF",{"$f":"IF('Input page School-age'!D24=\"\",\"\",'Input page School-age'!D24)","v":40},null,null,null,null,null,null,null,16,null,null,null,null,null,null,85]
[null,"Recognition of Pictures (Gv)","RPic",{"$f":"IF('Input page School-age'!D25=\"\",\"\",'Input page School-age'!D25)","v":43},null,null,null,null,null,null,null,24,null,null,null,null,null,null,89.5,null,null,null,null,null,null,null,null,null,null,0,11,14,15]
[null,"Early Number Concepts (Gc/Gf)","ENC",{"$f":"IF('Input page School-age'!D52=\"\",\"\",'Input page School-age'!D52)","v":""},null,null,null,null,null,{"$f":"IF(D32=\"\",\"\",D32)","v":""},null,"",null,null,null,null,null,null,{"$error":"#VALUE!"},null,null,"enc",{"$f":"J32","v":""},{"$f":"W32-W33","v":{"$error":"#VALUE!"}},{"$f":"IF(X32=0,\"\",IF(X32>0,\"ENC > MLLF\",\"ENC < MLLF\"))","v":{"$error":"#VALUE!"}},{"$f":"IF(ABS(X32)>10,Y32,\"\")","v":{"$error":"#VALUE!"}},null,null,null,0,12,15,16]
[null,"Matching Letter Like Forms (Gv)","MLLF",{"$f":"IF('Input page School-age'!D53=\"\",\"\",'Input page School-age'!D53)","v":""},null,null,null,null,null,{"$f":"IF(D33=\"\",\"\",D33)","v":""},null,"",null,null,null,null,null,null,{"$error":"#VALUE!"},null,null,"mllf",{"$f":"J33","v":""},{"$f":"W33-W34","v":{"$error":"#VALUE!"}},{"$f":"IF(X33=0,\"\",IF(X33>0,\"MLLF > PhP\",\"MLLF < PhP\"))","v":{"$error":"#VALUE!"}},{"$f":"IF(ABS(X33)>9,Y33,\"\")","v":{"$error":"#VALUE!"}},null,null,null,0,16,20,21]
[null,"Recall of Sequential Order (Gsm)","SeqO",{"$f":"IF('Input page School-age'!D26=\"\",\"\",'Input page School-age'!D26)","v":37},null,{"$f":"IF(D34=\"\",\"\",D34)","v":37},null,null,null,null,null,10,null,null,null,null,null,null,80.5,null,null,"php",{"$f":"J37","v":53},{"$f":"W32-W34","v":{"$error":"#VALUE!"}},{"$f":"IF(X34=0,\"\",IF(X34>0,\"ENC > PhP\",\"ENC < PhP\"))","v":{"$error":"#VALUE!"}},{"$f":"IF(ABS(X34)>7,Y34,\"\")","v":{"$error":"#VALUE!"}},{"$f":"Z32&\" \"&Z33&\" \"&Z34","v":{"$error":"#VALUE!"}},null,null,">15",15,10,"<10"]
[null,"Speed of Information Processing (Gs)","SIP",{"$f":"IF('Input page School-age'!D27=\"\",\"\",'Input page School-age'!D27)","v":""},null,null,null,{"$f":"IF(D35=\"\",\"\",D35)","v":""},null,null,null,"",null,null,null,null,null,null,{"$error":"#VALUE!"}]
[null,"Recall of Digits Backward (Gsm)","DigB",{"$f":"IF('Input page School-age'!D28=\"\",\"\",'Input page School-age'!D28)","v":50},null,{"$f":"IF(D36=\"\",\"\",D36)","v":50},null,null,null,null,null,50,null,null,null,null,null,null,100]
[null,"Phonological Processing (Ga)","PhP",{"$f":"IF('Input page School-age'!D29=\"\",\"\",'Input page School-age'!D29)","v":53},null,null,null,null,null,{"$f":"IF(D37=\"\",\"\",D37)","v":53},null,62,null,null,null,null,null,null,104.5]
[null,"Rapid Naming (Gs)","RNam",{"$f":"IF('Input page School-age'!D30=\"\",\"\",'Input page School-age'!D30)","v":44},null,null,null,{"$f":"IF(D38=\"\",\"\",D38)","v":44},null,null,null,27,null,null,null,null,null,null,91]
[null,"Diagnostic Cluster Scores"]
[]
[null,null,null,"Sum of Core T scores",null,{"$f":"IF(V42=\"\",\"\",\"(\"&V42&\")\")","v":"(87)"},null,{"$f":"IF(V43=\"\",\"\",\"(\"&V43&\")\")","v":""},null,{"$f":"IF(V44=\"\",\"\",\"(\"&V44&\")\")","v":""},null,null,null,null,null,null,null,null,null,null,null,null,null,{"$f":"gca","v":80},"gca"]
[null,null,null,"Standard Score",null,{"$f":"IF(F41=\"\",\"\",'Input page School-age'!D33)","v":89},null,{"$f":"IF(H41=\"\",\"\",'Input page School-age'!D34)","v":""},null,{"$f":"IF(J41=\"\",\"\",'Input page School-age'!D35)","v":""},null,null,null,null,null,null,null,null,null,null,null,{"$f":"IF(COUNT(F34:F37)<2,\"\",F34+F36)","v":87},null,{"$f":"wm","v":89},"wm",{"$f":"X42-X41","v":9},{"$f":"IF(Z42=0,\"\",IF(Z42>0,\"WM > GCA\",\"WM < GCA\"))","v":"WM > GCA"},{"$f":"IF(ABS(Z42)>8,AA42,\"No\")","v":"WM > GCA"},{"$f":"LOOKUP(ABS(Z42),AD32:AG32,AD34:AG34)","v":">15"}]
[null,null,null,"Percentile",null,{"$f":"IF(F41=\"\",\"\",LOOKUP(F42,sstopr))","v":23},null,{"$f":"IF(H41=\"\",\"\",LOOKUP(H42,sstopr))","v":""},null,{"$f":"IF(J41=\"\",\"\",LOOKUP(J42,sstopr))","v":""},null,null,null,null,null,null,null,null,null,null,null,{"$f":"IF(COUNT(H35:H38)<2,\"\",H35+H38)","v":""},null,{"$f":"ps","v":""},"ps",{"$f":"X43-X41","v":{"$error":"#VALUE!"}},{"$f":"IF(Z43=0,\"\",IF(Z43>0,\"PS > GCA\",\"PS < GCA\"))","v":{"$error":"#VALUE!"}},{"$f":"IF(ABS(Z43)>10,AA43,\"No\")","v":{"$error":"#VALUE!"}},{"$f":"LOOKUP(ABS(Z43),AD33:AG33,AD34:AG34)","v":{"$error":"#VALUE!"}}]
[null,null,null,"Confidence Interval",null,{"$f":"IF(F41=\"\",\"\",Z22&\" to \"&AA22)","v":"83 to 96"},null,{"$f":"IF(H41=\"\",\"\",Z23&\" to \"&AA23)","v":""},null,{"$f":"IF(J41=\"\",\"\",Z19&\" to \"&AA19)","v":""},null,null,null,null,null,null,null,null,null,null,null,{"$f":"IF(COUNT(J32:J37)<3,\"\",J32+J33+J37)","v":""},null,{"$f":"sr","v":""},"schr",{"$f":"X44-X41","v":{"$error":"#VALUE!"}},{"$f":"IF(Z44=0,\"\",IF(Z44>0,\"SR > GCA\",\"SR < GCA\"))","v":{"$error":"#VALUE!"}},{"$f":"IF(ABS(Z44)>8,AA44,\"\")","v":{"$error":"#VALUE!"}},{"$f":"X42-X44","v":{"$error":"#VALUE!"}},{"$f":"IF(AC44=0,\"\",IF(AC44>0,\"SR < WM\",\"SR > WM\"))","v":{"$error":"#VALUE!"}},{"$f":"IF(ABS(AC44)>9,AD44,\"\")","v":{"$error":"#VALUE!"}},{"$f":"X43-X44","v":{"$error":"#VALUE!"}},{"$f":"IF(AF44=0,\"\",IF(AF44>0,\"SR < PS\",\"SR > PS\"))","v":{"$error":"#VALUE!"}},{"$f":"IF(ABS(AF44)>11,AG44,\"\")","v":{"$error":"#VALUE!"}},{"$f":"AE44&\"   \"&AH44","v":{"$error":"#VALUE!"}}]
[null,null,null,"Difference from GCA",null,{"$f":"IF(F41=\"\",\"\",AB42)","v":"WM > GCA"},null,{"$f":"IF(H41=\"\",\"\",AB43)","v":""},null,{"$f":"IF(J41=\"\",\"\",AB44)","v":""},null,null,null,null,null,null,null,null,null,null,null,null,null,null,null,null,null,null,{"$f":"LOOKUP(Z44,AD31:AG31,AD34:AG34)","v":{"$error":"#VALUE!"}}]
[null,null,null,"Between Cluster Difference",null,{"$f":"IF(OR(F41=\"\",H41=\"\"),\"\",V59)","v":""},null,null,null,{"$f":"IF(J41=\"\",\"\",AI44)","v":""}]
[null,null,null,"Within Cluster Differences",null,{"$f":"IF(F41=\"\",\"\",V68)","v":"RSO < DB"},null,{"$f":"IF(H41=\"\",\"\",V69)","v":""},null,{"$f":"IF(J41=\"\",\"\",AA34)","v":""}]
[null,null,null,null,null,"Working Memory",null,"Processing Speed",null,"School Readiness",null,null,null,null,null,null,null,null,null,null,null,null,null,null,null,null,0,13,16,21,27,30,33]
[null,null,null,null,null,"(Gsm)",null,"(Gs)",null,"(7:0-8:11)",null,null,null,null,null,null,null,null,null,null,null,2,{"$f":"CHOOSE(btwcl,\".15\",\".05\",\".01\")","v":".05"},null,null,null,0,13,16,21,27,31,34]
[null,null,null,null,null,null,null,null,null,null,null,null,null,null,null,null,null,null,null,null,null,null,null,null,null,null,0,14,18,23,30,34,39]
[null,null,{"$f":"\"Comparisons at \"&W49&\" level\"","v":"Comparisons at .05 level"},null,null,null,null,"Difference",null,"Significance",null,"Frequency",null,null,null,null,null,null,null,null,null,"Score 1","Score2",null,"<=>",null,0,13,17,23,30,36,42]
[null,null,null,null,null,{"$f":"IF(V52=W52,\"Verbal (\"&F17&\") = Nonverbal Reasoning (\"&H17&\")\",IF(V52>W52,\"Verbal (\"&F17&\") > Nonverbal Reasoning (\"&H17&\")\",\"Verbal (\"&F17&\") < Nonverbal Reasoning (\"&H17&\")\"))","v":"Verbal (100) > Nonverbal Reasoning (74)"},null,{"$f":"IF(OR(V52=\"\",W52=\"\"),\"\",V52-W52)","v":26},null,{"$f":"IF(OR(V52=\"\",W52=\"\"),\"\",IF(ABS(H52)>=X52,\"Yes\",\"No\"))","v":"Yes"},null,{"$f":"IF(OR(V52=\"\",W52=\"\"),\"\",Z52&\"%\")","v":"5%"},null,null,null,null,null,null,null,null,"v vs nv",{"$f":"verb","v":100},{"$f":"nverb","v":74},{"$f":"CHOOSE(btwcl,9,13,17)","v":13},{"$f":"IF(V52=W52,2,IF(V52>W52,1,3))","v":1},{"$f":"IF(Y52=2,\">15\",IF(Y52=1,LOOKUP(ABS(H52),AA48:AG48,AA56:AG56),LOOKUP(ABS(H52),AA49:AG49,AA56:AG56)))","v":5},0,12,15,20,26,30,37]
[null,null,null,null,null,{"$f":"IF(V54=W54,\"Nonverbal  (\"&H17&\")  = Spatial (\"&J17&\")\",IF(V54>W54,\"Nonverbal  (\"&H17&\") > Spatial (\"&J17&\")\",\"Nonverbal  (\"&H17&\") < Spatial (\"&J17&\")\"))","v":"Nonverbal  (74) < Spatial (91)"},null,{"$f":"IF(OR(V54=\"\",W54=\"\"),\"\",V54-W54)","v":-17},null,{"$f":"IF(OR(V54=\"\",W54=\"\"),\"\",IF(ABS(H53)>=X54,\"Yes\",\"No\"))","v":"Yes"},null,{"$f":"IF(OR(V54=\"\",W54=\"\"),\"\",Z54&\"%\")","v":"10%"},null,null,null,null,null,null,null,null,"v vs sp",{"$f":"verb","v":100},{"$f":"sp","v":91},{"$f":"CHOOSE(btwcl,9,12,16)","v":12},{"$f":"IF(V53=W53,2,IF(V53>W53,1,3))","v":1},{"$f":"IF(Y53=2,\">15\",IF(Y53=1,LOOKUP(ABS(H54),AA50:AG50,AA56:AG56),LOOKUP(ABS(H54),AA51:AG51,AA56:AG56)))","v":">15"},0,12,15,19,25,31,34]
[null,null,null,null,null,{"$f":"IF(V53=W53,\"Verbal (\"&F17&\")= Spatial (\"&J17&\")\",IF(V53>W53,\"Verbal (\"&F17&\") > Spatial (\"&J17&\")\",\"Verbal (\"&F17&\") < Spatial (\"&J17&\")\"))","v":"Verbal (100) > Spatial (91)"},null,{"$f":"IF(OR(V53=\"\",W53=\"\"),\"\",V53-W53)","v":9},null,{"$f":"IF(OR(V53=\"\",W53=\"\"),\"\",IF(ABS(H54)>=X53,\"Yes\",\"No\"))","v":"No"},null,{"$f":"IF(OR(V53=\"\",W53=\"\"),\"\",Z53&\"%\")","v":">15%"},null,null,null,null,null,null,null,null,"nv vs sp",{"$f":"nverb","v":74},{"$f":"sp","v":91},{"$f":"CHOOSE(btwcl,8,10,14)","v":10},{"$f":"IF(V54=W54,2,IF(V54>W54,1,3))","v":3},{"$f":"IF(Y54=2,\">15\",IF(Y54=1,LOOKUP(ABS(H53),AA52:AG52,AA56:AG56),LOOKUP(ABS(H53),AA53:AG53,AA56:AG56)))","v":10},0,16,20,26,35,41,49]
[null,null,null,null,null,{"$f":"IF(V55=W55,\"Working Memory (\"&F42&\") = Processing Speed (\"&H42&\") \",IF(V55>W55,\"Working Memory (\"&F42&\") > Processing Speed (\"&H42&\")\",\"Working Memory (\"&F42&\")  < Processing Speed (\"&H42&\")\"))","v":"Working Memory (89)  < Processing Speed ()"},null,{"$f":"IF(OR(V55=\"\",W55=\"\"),\"\",V55-W55)","v":""},null,{"$f":"IF(OR(V55=\"\",W55=\"\"),\"\",IF(ABS(H55)>=X55,\"Yes\",\"No\"))","v":""},null,{"$f":"IF(OR(V55=\"\",W55=\"\"),\"\",Z55&\"%\")","v":""},null,null,null,null,null,null,null,null,null,{"$f":"F42","v":89},{"$f":"H42","v":""},{"$f":"CHOOSE(btwcl,9,12,15)","v":12},{"$f":"IF(V55=W55,2,IF(V55>W55,1,3))","v":3},{"$f":"IF(Y55=2,\"\",IF(Y55=1,LOOKUP(ABS(H55),AA54:AG54,AA56:AG56),LOOKUP(ABS(H55),AA55:AG55,AA56:AG56)))","v":{"$error":"#VALUE!"}},0,18,22,29,37,42,48]
[null,null,null,{"$f":"\"Verbal (\"&verb&\")      \"","v":"Verbal (100)      "},null,{"$f":"IF(OR(V60=\"\",W60=\"\"),\"\",X66)","v":""},null,null,null,null,null,null,null,null,null,null,null,null,null,null,null,{"$f":"IF(J52=\"No\",\"No\",IF(V52=W52,\"No\",IF(V52>W52,\"V > NVR\",\"V< NVR\")))","v":"V > NVR"},null,null,null,null,">15",15,10,5,2,1,0.5]
[null,null,null,null,null,{"$f":"IF(V49=X49,\"Word Definition (\"&F9&\") = Verbal Similarities (\"&F12&\") \",IF(V49>X49,\"Word Definition (\"&F9&\") > Verbal Similarities (\"&F12&\")\",\"Word Definition (\"&F9&\")  < Verbal Similarities (\"&F12&\")\"))","v":"Word Definition (43) > Verbal Similarities (40)"},null,{"$f":"IF(OR(V60=\"\",W60=\"\"),\"\",V60-W60)","v":3},null,{"$f":"IF(OR(V60=\"\",W60=\"\"),\"\",IF(ABS(H57)>=X60,\"Yes\",\"No\"))","v":"No"},null,{"$f":"IF(OR(V60=\"\",W60=\"\"),\"\",Z60&\"%\")","v":">15%"},null,null,null,null,null,null,null,null,null,{"$f":"IF(J54=\"No\",\"No\",IF(V53=W53,\"No\",IF(V53>W53,\"V > Sp\",\"V< Sp\")))","v":"No"}]
[null,null,null,{"$f":"\"Nonverbal Reasoning (\"&nverb&\")      \"","v":"Nonverbal Reasoning (74)      "},null,{"$f":"IF(OR(V61=\"\",W61=\"\"),\"\",X67)","v":"Interpret With Caution"},null,null,null,null,null,null,null,null,null,null,null,null,null,null,null,{"$f":"IF(J53=\"No\",\"No\",IF(V54=W54,\"No\",IF(V54>W54,\"NVR > Sp\",\"NVR < Sp\")))","v":"NVR < Sp"}]
[null,null,null,null,null,{"$f":"IF(V61=W61,\"Matrices (\"&H11&\") = Sequential & Quantitative Reasoning (\"&H13&\") \",IF(V61>W61,\"Matrices (\"&H11&\") > Sequential & Quantitative Reasoning (\"&H13&\")\",\"Matrices (\"&H11&\")  < Sequential & Quantitative Reasoning (\"&H13&\")\"))","v":"Matrices (27)  < Sequential & Quantitative Reasoning (41)"},null,{"$f":"IF(OR(V61=\"\",W61=\"\"),\"\",V61-W61)","v":-14},null,{"$f":"IF(OR(V61=\"\",W61=\"\"),\"\",IF(ABS(H59)>=X61,\"Yes\",\"No\"))","v":"Yes"},null,{"$f":"IF(OR(V61=\"\",W61=\"\"),\"\",Z61&\"%\")","v":"5%"},null,null,null,null,null,null,null,null,null,{"$f":"IF(J55=\"No\",\"No\",IF(V55=W55,\"No\",IF(V55>W55,\"WM > PS\",\"WM < PS\")))","v":"WM < PS"}]
[null,null,null,{"$f":"\"Spatial (\"&sp&\")      \"","v":"Spatial (91)      "},null,{"$f":"IF(OR(V62=\"\",W62=\"\"),\"\",X68)","v":"Interpret With Caution"},null,null,null,null,null,null,null,null,null,null,null,null,null,null,null,{"$f":"F9","v":43},{"$f":"F12","v":40},{"$f":"CHOOSE(btwcl,9,12,16)","v":12},{"$f":"IF(V60=W60,2,IF(V60>W60,1,3))","v":1},{"$f":"IF(Y60=2,\">15\",IF(Y60=1,LOOKUP(ABS(H57),AA60:AE60,AA70:AE70),LOOKUP(ABS(H57),AA61:AE61,AA70:AE70)))","v":">15"},0,8,10,14,19,"wd>S"]
[null,null,null,null,null,{"$f":"IF(V62=W62,\"Recall of Designs (\"&J8&\") = Pattern Construction (\"&J10&\") \",IF(V62>W62,\"Recall of Designs (\"&J8&\") > Pattern Construction (\"&J10&\")\",\"Recall of Designs (\"&J8&\")  < Pattern Construction (\"&J10&\")\"))","v":"Recall of Designs (80) > Pattern Construction (39)"},null,{"$f":"IF(OR(V62=\"\",W62=\"\"),\"\",V62-W62)","v":41},null,{"$f":"IF(OR(V62=\"\",W62=\"\"),\"\",IF(ABS(H61)>=X62,\"Yes\",\"No\"))","v":"Yes"},null,{"$f":"IF(OR(V62=\"\",W62=\"\"),\"\",Z62&\"%\")","v":"<5%"},null,null,null,null,null,null,null,null,null,{"$f":"H11","v":27},{"$f":"H13","v":41},{"$f":"CHOOSE(btwcl,7,9,12)","v":9},{"$f":"IF(V61=W61,2,IF(V61>W61,1,3))","v":3},{"$f":"IF(Y61=2,\">15\",IF(Y61=1,LOOKUP(ABS(H59),AA62:AE62,AA70:AE70),LOOKUP(ABS(H59),AA63:AE63,AA70:AE70)))","v":5},0,8,10,13,16,"Wd<s"]
[null,null,null,{"$f":"\"Working Memory (\"&V55&\")      \"","v":"Working Memory (89)      "},null,{"$f":"IF(OR(V63=\"\",W63=\"\"),\"\",X69)","v":"Interpret With Caution"},null,null,null,null,null,null,null,null,null,null,null,null,null,null,null,{"$f":"J8","v":80},{"$f":"J10","v":39},{"$f":"CHOOSE(btwcl,6,8,11)","v":8},{"$f":"IF(V62=W62,2,IF(V62>W62,1,3))","v":1},{"$f":"IF(Y62=2,\">15\",IF(Y62=1,LOOKUP(ABS(H61),AA64:AE64,AA70:AE70),LOOKUP(ABS(H61),AA65:AE65,AA70:AE70)))","v":"<5"},0,9,11,14,17,"m>sq"]
[null,null,null,null,null,{"$f":"IF(V63=W63,\"Recall of Sequential Order (\"&F34&\") = Recall of Digits Backward (\"&F36&\") \",IF(V63>W63,\"Recall of Sequential Order (\"&F34&\") > Recall of Digits Backward (\"&F36&\")\",\"Recall of Sequential Order (\"&F34&\")  < Recall of Digits Backward (\"&F36&\")\"))","v":"Recall of Sequential Order (37)  < Recall of Digits Backward (50)"},null,{"$f":"IF(OR(V63=\"\",W63=\"\"),\"\",V63-W63)","v":-13},null,{"$f":"IF(OR(V63=\"\",W63=\"\"),\"\",IF(ABS(H63)>=X63,\"Yes\",\"No\"))","v":"Yes"},null,{"$f":"IF(OR(V63=\"\",W63=\"\"),\"\",Z63&\"%\")","v":"10%"},null,null,null,null,null,null,null,null,null,{"$f":"F34","v":37},{"$f":"F36","v":50},{"$f":"CHOOSE(btwcl,6,8,10)","v":8},{"$f":"IF(V63=W63,2,IF(V63>W63,1,3))","v":3},{"$f":"IF(Y63=2,\">15\",IF(Y63=1,LOOKUP(ABS(H63),AA66:AE66,AA70:AE70),LOOKUP(ABS(H63),AA67:AE67,AA70:AE70)))","v":10},0,9,11,14,20,"M<sq"]
[null,null,null,{"$f":"\"Processing Speed (\"&W55&\")      \"","v":"Processing Speed ()      "},null,{"$f":"IF(OR(V64=\"\",W64=\"\"),\"\",X70)","v":""},null,null,null,null,null,null,null,null,null,null,null,null,null,null,null,{"$f":"H35","v":""},{"$f":"H38","v":44},{"$f":"CHOOSE(btwcl,8,10,14)","v":10},{"$f":"IF(V64=W64,2,IF(V64>W64,1,3))","v":1},{"$f":"IF(Y64=2,\">15\",IF(Y64=1,LOOKUP(ABS(I65),AA68:AE68,AA70:AE70),LOOKUP(ABS(I65),AA69:AE69,AA70:AE70)))","v":{"$error":"#VALUE!"}},0,9,12,15,19,"rdes>pc"]
[null,null,null,null,null,{"$f":"IF(V64=W64,\"Speed of Information Processing (\"&H35&\") = Rapid Naming (\"&H38&\") \",IF(V64>W64,\"Speed of Information Processing (\"&H35&\") > Rapid Naming (\"&H38&\")\",\"Speed of Information Processing (\"&H35&\")  < Rapid Naming (\"&H38&\")\"))","v":"Speed of Information Processing () > Rapid Naming (44)"},null,{"$f":"IF(OR(V64=\"\",W64=\"\"),\"\",V64-W64)","v":""},{"$f":"V64-W64","v":{"$error":"#VALUE!"}},{"$f":"IF(OR(V64=\"\",W64=\"\"),\"\",IF(ABS(I65)>=X64,\"Yes\",\"No\"))","v":""},null,{"$f":"IF(OR(V64=\"\",W64=\"\"),\"\",Z64&\"%\")","v":""},null,null,null,null,null,null,null,null,null,{"$f":"IF(J57=\"No\",\"No\",IF(V60=W60,\"No\",IF(V60>W60,\"WD > VSim\",\"WD < VSim\")))","v":"No"},null,null,null,null,0,9,11,15,20,"Rdes<pc"]
[null,null,null,null,null,null,null,null,null,null,null,null,null,null,null,null,null,null,null,null,null,{"$f":"IF(J59=\"No\",\"No\",IF(V61=W61,\"No\",IF(V61>W61,\"Mat > SQR\",\"Mat < SQR\")))","v":"Mat < SQR"},null,{"$f":"IF(J57=\"No\",\"\",\"Interpret With Caution\")","v":""},null,null,0,9,11,15,21,"rso>db"]
[null,null,null,null,null,null,null,null,null,null,null,null,null,null,null,null,null,null,null,null,null,{"$f":"IF(J61=\"No\",\"No\",IF(J61=\"No\",\"No\",IF(V62=W62,\"\",IF(V62>W62,\"RDes > PC\",\"RDes < PC\"))))","v":"RDes > PC"},null,{"$f":"IF(J59=\"No\",\"\",\"Interpret With Caution\")","v":"Interpret With Caution"},null,null,0,9,11,14,19,"rso<db"]
[null,null,null,null,null,{"$f":"V74","v":45},null,"Difference required",null,null,null,null,null,null,null,null,null,null,null,null,null,{"$f":"IF(J63=\"No\",\"No\",IF(J63=\"No\",\"No\",IF(V63=W63,\"No\",IF(V63>W63,\"RSO > DB\",\"RSO < DB\"))))","v":"RSO < DB"},null,{"$f":"IF(J61=\"No\",\"\",\"Interpret With Caution\")","v":"Interpret With Caution"},null,null,0,11,14,18,24,"sip>rn"]
[null,null,null,null,null,"T Score",null,null,null,"Difference",null,"Significance",null,"Frequency",null,null,null,null,null,null,null,{"$f":"IF(J65=\"No\",\"No\",IF(J65=\"No\",\"No\",IF(V64=W64,\"No\",IF(V64>W64,\"SIP > RN\",\"SIP < RN\"))))","v":"SIP > RN"},null,{"$f":"IF(J63=\"No\",\"\",\"Interpret With Caution\")","v":"Interpret With Caution"},null,null,0,11,14,18,22,"sip<rn"]
[null,null,null,null,{"$f":"B9","v":"Word Definition (Gc)"},{"$f":"D9","v":43},null,{"$f":"IF(F70=\"\",\"\",X75)","v":7},null,{"$f":"IF(OR(F68=\"\",F70=\"\"),\"\",U75-V75)","v":-2},null,{"$f":"IF(J70=\"\",\"\",Z75)","v":""},null,{"$f":"IF(L70=\"\",\"\",IF(meant=1,AB75&\"%\",AC75&\"%\"))","v":""},null,null,null,null,null,null,null,null,null,{"$f":"IF(J65=\"No\",\"\",\"Interpret With Caution\")","v":"Interpret With Caution"},null,null,">15",15,10,5,"<5"]
[null,null,null,null,{"$f":"B12","v":"Verbal Similarities (Gc)"},{"$f":"D12","v":40},null,{"$f":"IF(F71=\"\",\"\",X78)","v":8},null,{"$f":"IF(OR(F68=\"\",F71=\"\"),\"\",U78-V78)","v":-5},null,{"$f":"IF(J71=\"\",\"\",Z78)","v":""},null,{"$f":"IF(L71=\"\",\"\",IF(meant=1,AB78&\"%\",AC78&\"%\"))","v":""}]
[null,null,null,null,{"$f":"B11","v":"Matrices (Gf)"},{"$f":"D11","v":27},null,{"$f":"IF(F72=\"\",\"\",X77)","v":7},null,{"$f":"IF(OR(F68=\"\",F72=\"\"),\"\",U77-V77)","v":-18},null,{"$f":"IF(J72=\"\",\"\",Z77)","v":"Low"},null,{"$f":"IF(L72=\"\",\"\",IF(meant=1,AB77&\"%\",AC77&\"%\"))","v":"<10%"},null,null,null,null,null,null,null,{"$f":"IF(meant=1,\"GCA\",\"SNC\")","v":"GCA"}]
[null,null,null,null,{"$f":"B13","v":"Sequential & Quantitative Reasoning (Gf)"},{"$f":"D13","v":41},null,{"$f":"IF(F73=\"\",\"\",X79)","v":6},null,{"$f":"IF(OR(F68=\"\",F73=\"\"),\"\",U79-V79)","v":-4},null,{"$f":"IF(J73=\"\",\"\",Z79)","v":""},null,{"$f":"IF(L73=\"\",\"\",IF(meant=1,AB79&\"%\",AC79&\"%\"))","v":""},null,null,null,null,null,null,1,"m t","diff","cv","<=>","sig","<=>","gca","snc"]
[null,null,null,null,{"$f":"B8","v":"Recall of Designs (Gv)"},{"$f":"D8","v":80},null,{"$f":"IF(F74=\"\",\"\",X74)","v":7},null,{"$f":"IF(OR(F68=\"\",F74=\"\"),\"\",U74-V74)","v":35},null,{"$f":"IF(J74=\"\",\"\",Z74)","v":"High"},null,{"$f":"IF(L74=\"\",\"\",IF(meant=1,AB74&\"%\",AC74&\"%\"))","v":"<10%"},null,null,null,null,null,null,{"$f":"F74","v":80},{"$f":"IF(meant=1,$L$22,$N$22)","v":45},{"$f":"ABS(U74-V74)","v":35},{"$f":"IF(AND(btwcl=1,meant=1),5,IF(AND(btwcl=2,meant=1),7,IF(AND(btwcl=3,meant=1),9,IF(AND(btwcl=1,meant=2),4,IF(AND(btwcl=2,meant=2),6,IF(AND(btwcl=3,meant=2),8))))))","v":7},{"$f":"IF(U74=V74,\"\",IF(U74>V74,\"High\",\"Low\"))","v":"High"},{"$f":"IF(W74>=X74,Y74,\"\")","v":"High"},{"$f":"IF(U74<V74,3,IF(U74>V74,1,2))","v":1},{"$f":"IF(AA74=1,LOOKUP(W74,AD74:AG74,$AD$102:$AG$102),LOOKUP(W74,AD75:AG75,$AD$102:$AG$102))","v":"<10"},{"$f":"IF(AB74=3,LOOKUP(W74,AH74:AK74,$AD$102:$AG$102),LOOKUP(W74,AH75:AK75,$AD$102:$AG$102))","v":"<10"},0,7,8,9,0,6,8,9,{"$f":"E74","v":"Recall of Designs (Gv)"}]
[null,null,null,null,{"$f":"B10","v":"Pattern Construction (Gv)"},{"$f":"D10","v":39},null,{"$f":"IF(F75=\"\",\"\",X76)","v":5},null,{"$f":"IF(OR(F68=\"\",F75=\"\"),\"\",U76-V76)","v":-6},null,{"$f":"IF(J75=\"\",\"\",Z76)","v":"Low"},null,{"$f":"IF(L75=\"\",\"\",IF(meant=1,AB76&\"%\",AC76&\"%\"))","v":"15%"},null,null,null,null,null,null,{"$f":"F70","v":43},45,2,{"$f":"IF(AND(btwcl=1,meant=1),5,IF(AND(btwcl=2,meant=1),7,IF(AND(btwcl=3,meant=1),9,IF(AND(btwcl=1,meant=2),7,IF(AND(btwcl=2,meant=2),9,IF(AND(btwcl=3,meant=2),12))))))","v":7},"Low","",3,{"$f":"IF(AA75=1,LOOKUP(W75,AD76:AG76,$AD$102:$AG$102),LOOKUP(W75,AD77:AG77,$AD$102:$AG$102))","v":">15"},{"$f":"IF(AB75=3,LOOKUP(W75,AH76:AK76,$AD$102:$AG$102),LOOKUP(W75,AH77:AK77,$AD$102:$AG$102))","v":">15"},0,7,9,10,0,6,8,9]
[null,null,null,null,null,null,null,null,null,null,null,null,null,null,null,null,null,null,null,null,{"$f":"F75","v":39},45,6,{"$f":"IF(AND(btwcl=1,meant=1),4,IF(AND(btwcl=2,meant=1),5,IF(AND(btwcl=3,meant=1),7,IF(AND(btwcl=1,meant=2),4,IF(AND(btwcl=2,meant=2),5,IF(AND(btwcl=3,meant=2),7))))))","v":5},"Low","Low",3,{"$f":"IF(AA76=1,LOOKUP(W76,AD78:AG78,$AD$102:$AG$102),LOOKUP(W76,AD79:AG79,$AD$102:$AG$102))","v":15},{"$f":"IF(AB76=3,LOOKUP(W76,AH78:AK78,$AD$102:$AG$102),LOOKUP(W76,AH79:AK79,$AD$102:$AG$102))","v":15},0,6,8,9,0,8,10,11,{"$f":"E70","v":"Word Definition (Gc)"}]
[null,null,null,null,{"$f":"B28","v":"Recall of Objects-Immediate (Glr)"},{"$f":"D28","v":59},null,{"$f":"IF(F77=\"\",\"\",X81)","v":9},null,{"$f":"IF(OR(F68=\"\",F77=\"\"),\"\",U81-V81)","v":14},null,{"$f":"IF(J77=\"\",\"\",Z81)","v":"High"},null,{"$f":"IF(L77=\"\",\"\",IF(meant=1,AB81&\"%\",AC81&\"%\"))","v":"<10%"},null,null,null,null,null,null,{"$f":"F72","v":27},45,18,{"$f":"IF(AND(btwcl=1,meant=1),5,IF(AND(btwcl=2,meant=1),7,IF(AND(btwcl=3,meant=1),9,IF(AND(btwcl=1,meant=2),4,IF(AND(btwcl=2,meant=2),6,IF(AND(btwcl=3,meant=2),8))))))","v":7},"Low","Low",3,{"$f":"IF(AA77=1,LOOKUP(W77,AD80:AG80,$AD$102:$AG$102),LOOKUP(W77,AD81:AG81,$AD$102:$AG$102))","v":"<10"},{"$f":"IF(AB77=13,LOOKUP(W77,AH80:AK80,$AD$102:$AG$102),LOOKUP(W77,AH81:AK81,$AD$102:$AG$102))","v":"<10"},0,6,8,9,0,8,10,11]
[null,null,null,null,{"$f":"B29","v":"Recall of Objects-Delayed (Glr)"},{"$f":"D29","v":60},null,null,null,null,null,{"$f":"IF(F78=\"\",\"\",Z82)","v":""},null,null,null,null,null,null,null,null,{"$f":"F71","v":40},45,5,{"$f":"IF(AND(btwcl=1,meant=1),6,IF(AND(btwcl=2,meant=1),8,IF(AND(btwcl=3,meant=1),10,IF(AND(btwcl=1,meant=2),7,IF(AND(btwcl=2,meant=2),10,IF(AND(btwcl=3,meant=2),13))))))","v":8},"Low","",3,{"$f":"IF(AA78=1,LOOKUP(W78,AD82:AG82,$AD$102:$AG$102),LOOKUP(W78,AD83:AG83,$AD$102:$AG$102))","v":">15"},{"$f":"IF(AB78=3,LOOKUP(W78,AH82:AK82,$AD$102:$AG$102),LOOKUP(W78,AH83:AK83,$AD$102:$AG$102))","v":">15"},0,6,7,8,0,5,7,8,{"$f":"E75","v":"Pattern Construction (Gv)"}]
[null,null,null,null,{"$f":"B30","v":"Recall of Digits Forward (Gsm)"},{"$f":"D30","v":40},null,{"$f":"IF(F79=\"\",\"\",X83)","v":7},null,{"$f":"IF(OR(F68=\"\",F79=\"\"),\"\",U83-V83)","v":-5},null,{"$f":"IF(J79=\"\",\"\",Z83)","v":""},null,{"$f":"IF(L79=\"\",\"\",IF(meant=1,AB83&\"%\",AC83&\"%\"))","v":""},null,null,null,null,null,null,{"$f":"F73","v":41},45,4,{"$f":"IF(AND(btwcl=1,meant=1),4,IF(AND(btwcl=2,meant=1),6,IF(AND(btwcl=3,meant=1),8,IF(AND(btwcl=1,meant=2),4,IF(AND(btwcl=2,meant=2),5,IF(AND(btwcl=3,meant=2),7))))))","v":6},"Low","",3,{"$f":"IF(AA79=1,LOOKUP(W79,AD84:AG84,$AD$102:$AG$102),LOOKUP(W79,AD85:AG85,$AD$102:$AG$102))","v":">15"},{"$f":"IF(AB79=3,LOOKUP(W79,AH84:AK84,$AD$102:$AG$102),LOOKUP(W79,AH85:AK85,$AD$102:$AG$102))","v":">15"},0,6,8,9,0,6,7,8]
[null,null,null,null,{"$f":"B31","v":"Recognition of Pictures (Gv)"},{"$f":"D31","v":43},null,13,null,{"$f":"IF(OR(F68=\"\",F80=\"\"),\"\",U84-V84)","v":-2},null,"",null,"",null,null,null,null,null,null,null,null,null,null,null,null,null,null,null,0,6,8,9,0,6,8,9,{"$f":"E72","v":"Matrices (Gf)"}]
[null,null,null,null,{"$f":"B34","v":"Recall of Sequential Order (Gsm)"},{"$f":"D34","v":37},null,7,null,{"$f":"IF(OR(F68=\"\",F81=\"\"),\"\",U85-V85)","v":-8},null,"Low",null,"15%",null,null,null,null,null,null,{"$f":"F77","v":59},{"$f":"IF(meant=1,$L$22,$N$22)","v":45},{"$f":"ABS(U81-V81)","v":14},{"$f":"IF(AND(btwcl=1,meant=1),7,IF(AND(btwcl=2,meant=1),9,IF(AND(btwcl=3,meant=1),12,IF(AND(btwcl=1,meant=2),7,IF(AND(btwcl=2,meant=2),9,IF(AND(btwcl=3,meant=2),12))))))","v":9},{"$f":"IF(U81=V81,\"\",IF(U81>V81,\"High\",\"Low\"))","v":"High"},{"$f":"IF(W81>=X81,Y81,\"\")","v":"High"},{"$f":"IF(U81<V81,3,IF(U81>V81,1,2))","v":1},{"$f":"IF(AA81=1,LOOKUP(W81,AD86:AG86,$AD$102:$AG$102),LOOKUP(W81,AD87:AG87,$AD$102:$AG$102))","v":"<10"},{"$f":"IF(AB81=3,LOOKUP(W81,AH86:AK86,$AD$102:$AG$102),LOOKUP(W81,AH87:AK87,$AD$102:$AG$102))","v":15},0,6,8,9,0,6,7,8]
[null,null,null,null,{"$f":"B35","v":"Speed of Information Processing (Gs)"},{"$f":"D35","v":""},null,"",null,{"$f":"IF(OR(F68=\"\",F82=\"\"),\"\",U86-V86)","v":""},null,"",null,"",null,null,null,null,null,null,60,{"$f":"F77","v":59},1,11,{"$f":"IF(U82=V82,\"\",IF(U82>V82,\"RObI < RObD\",\"RObI > RObD\"))","v":"RObI < RObD"},"",1,{"$f":"IF(AA82=1,LOOKUP(W82,AD82:AG82,$AD$102:$AG$102),LOOKUP(W82,AD83:AG83,$AD$102:$AG$102))","v":">15"},{"$f":"IF(AA82=1,LOOKUP(W82,AH82:AK82,$AD$102:$AG$102),LOOKUP(W82,AH83:AK83,$AD$102:$AG$102))","v":">15"},0,7,8,9,0,9,10,11,{"$f":"E71","v":"Verbal Similarities (Gc)"}]
[null,null,null,null,{"$f":"B36","v":"Recall of Digits Backward (Gsm)"},{"$f":"D36","v":50},null,7,null,{"$f":"IF(OR(F68=\"\",F83=\"\"),\"\",U87-V87)","v":5},null,"",null,"",null,null,null,null,null,null,40,{"$f":"IF(meant=1,$L$22,$N$22)","v":45},5,{"$f":"IF(AND(btwcl=1,meant=1),5,IF(AND(btwcl=2,meant=1),7,IF(AND(btwcl=3,meant=1),10,IF(AND(btwcl=1,meant=2),5,IF(AND(btwcl=2,meant=2),7,IF(AND(btwcl=3,meant=2),10))))))","v":7},{"$f":"IF(U83=V83,\"\",IF(U83>V83,\"High\",\"Low\"))","v":"Low"},"",3,{"$f":"IF(AA83=1,LOOKUP(W83,AD88:AG88,$AD$102:$AG$102),LOOKUP(W83,AD89:AG89,$AD$102:$AG$102))","v":">15"},{"$f":"IF(AB83=3,LOOKUP(W83,AH88:AK88,$AD$102:$AG$102),LOOKUP(W83,AH89:AK89,$AD$102:$AG$102))","v":">15"},0,6,8,9,0,8,10,11]
[null,null,null,null,{"$f":"B37","v":"Phonological Processing (Ga)"},{"$f":"D37","v":53},null,9,null,{"$f":"IF(OR(F68=\"\",F84=\"\"),\"\",U88-V88)","v":8},null,"",null,"",null,null,null,null,null,null,43,45,2,{"$f":"IF(AND(btwcl=1,meant=1),9,IF(AND(btwcl=2,meant=1),13,IF(AND(btwcl=3,meant=1),17,IF(AND(btwcl=1,meant=2),9,IF(AND(btwcl=2,meant=2),13,IF(AND(btwcl=3,meant=2),17))))))","v":13},"Low","",3,{"$f":"IF(AA84=1,LOOKUP(W84,AD90:AG90,$AD$102:$AG$102),LOOKUP(W84,AD91:AG91,$AD$102:$AG$102))","v":">15"},{"$f":"IF(AB84=3,LOOKUP(W84,AH90:AK90,$AD$102:$AG$102),LOOKUP(W84,AH91:AK91,$AD$102:$AG$102))","v":">15"},0,6,7,8,0,5,7,8,{"$f":"E73","v":"Sequential & Quantitative Reasoning (Gf)"}]
[null,null,null,null,{"$f":"B38","v":"Rapid Naming (Gs)"},{"$f":"D38","v":44},null,10,null,{"$f":"IF(OR(F68=\"\",F85=\"\"),\"\",U89-V89)","v":-1},null,"",null,"",null,null,null,null,null,null,37,45,8,{"$f":"IF(AND(btwcl=1,meant=1),5,IF(AND(btwcl=2,meant=1),7,IF(AND(btwcl=3,meant=1),9,IF(AND(btwcl=1,meant=2),5,IF(AND(btwcl=2,meant=2),7,IF(AND(btwcl=3,meant=2),9))))))","v":7},"Low","Low",3,{"$f":"IF(AA85=1,LOOKUP(W85,AD92:AG92,$AD$102:$AG$102),LOOKUP(W85,AD93:AG93,$AD$102:$AG$102))","v":15},{"$f":"IF(AB85=3,LOOKUP(W85,AH92:AK92,$AD$102:$AG$102),LOOKUP(W85,AH93:AK93,$AD$102:$AG$102))","v":">15"},0,6,7,8,0,5,7,8]
[null,null,null,null,null,null,null,null,null,null,null,null,null,null,null,null,null,null,null,null,"",45,{"$error":"#VALUE!"},{"$f":"IF(AND(btwcl=1,meant=1),5,IF(AND(btwcl=2,meant=1),7,IF(AND(btwcl=3,meant=1),10,IF(AND(btwcl=1,meant=2),5,IF(AND(btwcl=2,meant=2),7,IF(AND(btwcl=3,meant=2),10))))))","v":7},"High",{"$error":"#VALUE!"},1,{"$f":"IF(AA86=1,LOOKUP(W86,AD94:AG94,$AD$102:$AG$102),LOOKUP(W86,AD95:AG95,$AD$102:$AG$102))","v":{"$error":"#VALUE!"}},{"$f":"IF(AB86=3,LOOKUP(W86,AH94:AK94,$AD$102:$AG$102),LOOKUP(W86,AH95:AK95,$AD$102:$AG$102))","v":{"$error":"#VALUE!"}},0,9,12,13,0,10,13,14,{"$f":"E77","v":"Recall of Objects-Immediate (Glr)"}]
[null,null,null,null,null,null,null,null,null,null,null,null,null,null,null,null,null,null,null,null,50,45,5,{"$f":"IF(AND(btwcl=1,meant=1),5,IF(AND(btwcl=2,meant=1),7,IF(AND(btwcl=3,meant=1),10,IF(AND(btwcl=1,meant=2),5,IF(AND(btwcl=2,meant=2),7,IF(AND(btwcl=3,meant=2),10))))))","v":7},"High","",1,{"$f":"IF(AA87=1,LOOKUP(W87,AD96:AG96,$AD$102:$AG$102),LOOKUP(W87,AD97:AG97,$AD$102:$AG$102))","v":">15"},{"$f":"IF(AB87=3,LOOKUP(W87,AH96:AK96,$AD$102:$AG$102),LOOKUP(W87,AH97:AK97,$AD$102:$AG$102))","v":">15"},0,12,14,15,0,12,15,16]
[null,null,null,null,null,null,null,null,null,"Ability Score",null,null,null,null,null,null,null,null,null,null,53,45,8,{"$f":"IF(AND(btwcl=1,meant=1),6,IF(AND(btwcl=2,meant=1),9,IF(AND(btwcl=3,meant=1),11,IF(AND(btwcl=1,meant=2),6,IF(AND(btwcl=2,meant=2),9,IF(AND(btwcl=3,meant=2),11))))))","v":9},"High","",{"$f":"IF(U88<V88,3,IF(U88>V88,1,IF(U88=V88,2)))","v":1},{"$f":"IF(AA88=1,LOOKUP(W88,AD98:AG98,$AD$102:$AG$102),LOOKUP(W88,AD99:AG99,$AD$102:$AG$102))","v":15},{"$f":"IF(AB88=3,LOOKUP(W88,AH98:AK98,$AD$102:$AG$102),LOOKUP(W88,AH99:AK99,$AD$102:$AG$102))","v":15},0,9,12,13,0,10,13,14,{"$f":"E79","v":"Recall of Digits Forward (Gsm)"}]
[null,null,"Phonological Processing (Ability Score Comparisons)",null,null,null,null,null,null,"Difference",null,"Critical Value",null,"Significance",null,null,null,null,null,null,44,45,1,{"$f":"IF(AND(btwcl=1,meant=1),7,IF(AND(btwcl=2,meant=1),10,IF(AND(btwcl=3,meant=1),13,IF(AND(btwcl=1,meant=2),7,IF(AND(btwcl=2,meant=2),10,IF(AND(btwcl=3,meant=2),13))))))","v":10},"Low","",{"$f":"IF(U89<V89,3,IF(U89>V89,1,2))","v":3},{"$f":"IF(AA89=1,LOOKUP(W89,AD100:AG100,$AD$102:$AG$102),LOOKUP(W89,AD101:AG101,$AD$102:$AG$102))","v":">15"},{"$f":"IF(AB89=3,LOOKUP(W89,AH100:AK100,$AD$102:$AG$102),LOOKUP(W89,AH101:AK101,$AD$102:$AG$102))","v":">15"},0,10,13,14,0,11,13,14]
[null,null,null,null,null,null,null,{"$f":"'Input page School-age'!C38&\" versus \"&'Input page School-age'!C40","v":"Task 1 (Rhyming) versus Task 2 (Blending)"},null,{"$f":"IF(AA92=1,\"\",W92)","v":""},null,{"$f":"IF(J90=\"\",\"\",Z92)","v":""},null,{"$f":"IF(AA92=1,\"\",IF(J90=\"\",\"\",IF(J90>=L90,\"Yes\",\"No\")))","v":""},null,null,null,null,null,null,null,null,null,null,null,null,null,null,null,0,9,12,13,0,9,12,13,{"$f":"E80","v":"Recognition of Pictures (Gv)"}]
[null,null,null,null,null,null,null,{"$f":"'Input page School-age'!C38&\" versus \"&'Input page School-age'!C42","v":"Task 1 (Rhyming) versus Task 3 (Deletion)"},null,"",null,"",null,"",null,null,null,null,null,null,"ab","ab","diff","sem","sem2","cv",null,null,null,0,10,12,13,0,10,12,13]
[null,null,null,null,null,null,null,{"$f":"'Input page School-age'!C38&\" versus \"&'Input page School-age'!C44","v":"Task 1 (Rhyming) versus Task 4 (Phoneme Identification and Segmentation)"},null,"",null,"",null,"",null,null,null,null,null,12,{"$f":"IF('Input page School-age'!D38=\"\",\"\",'Input page School-age'!D38)","v":""},{"$f":"IF('Input page School-age'!D40=\"\",\"\",'Input page School-age'!D40)","v":""},{"$f":"IF(OR('Input page School-age'!D38=\"\",'Input page School-age'!D40=\"\"),\"\",ABS(U92-V92))","v":""},{"$f":"IF('Input page School-age'!F38=\"\",\"\",'Input page School-age'!F38)","v":""},{"$f":"IF('Input page School-age'!F40=\"\",\"\",'Input page School-age'!F40)","v":""},{"$f":"IF(OR(X92=\"\",Y92=\"\"),\"\",1.65*SQRT(X92^2+Y92^2))","v":""},{"$f":"IF(U92=\"\",1,IF(V92=\"\",1, IF(Y92=\"\",1,IF(Z92=\"\",1,0))))","v":1},null,null,0,8,10,11,0,8,10,11,{"$f":"E81","v":"Recall of Sequential Order (Gsm)"}]
[null,null,null,null,null,null,null,{"$f":"'Input page School-age'!C40&\" versus \"&'Input page School-age'!C42","v":"Task 2 (Blending) versus Task 3 (Deletion)"},null,"",null,"",null,"",null,null,null,null,null,13,{"$f":"IF('Input page School-age'!D38=\"\",\"\",'Input page School-age'!D38)","v":""},{"$f":"IF('Input page School-age'!D42=\"\",\"\",'Input page School-age'!D42)","v":""},{"$f":"IF(OR('Input page School-age'!D38=\"\",'Input page School-age'!D42=\"\"),\"\",ABS(U93-V93))","v":""},{"$f":"IF('Input page School-age'!F38=\"\",\"\",'Input page School-age'!F38)","v":""},{"$f":"IF('Input page School-age'!F42=\"\",\"\",'Input page School-age'!F42)","v":""},"",1,null,null,0,8,10,11,0,9,11,12]
[null,null,null,null,null,null,null,{"$f":"'Input page School-age'!C40&\" versus \"&'Input page School-age'!C44","v":"Task 2 (Blending) versus Task 4 (Phoneme Identification and Segmentation)"},null,"",null,"",null,"",null,null,null,null,null,14,{"$f":"IF('Input page School-age'!D38=\"\",\"\",'Input page School-age'!D38)","v":""},{"$f":"IF('Input page School-age'!D44=\"\",\"\",'Input page School-age'!D44)","v":""},{"$f":"IF(OR('Input page School-age'!D38=\"\",'Input page School-age'!D44=\"\"),\"\",ABS(U94-V94))","v":""},{"$f":"IF('Input page School-age'!F38=\"\",\"\",'Input page School-age'!F38)","v":""},{"$f":"IF('Input page School-age'!F44=\"\",\"\",'Input page School-age'!F44)","v":""},"",1,null,null,0,11,14,15,0,11,14,15,{"$f":"E82","v":"Speed of Information Processing (Gs)"}]
[null,null,null,null,null,null,null,{"$f":"'Input page School-age'!C42&\" versus \"&'Input page School-age'!C44","v":"Task 3 (Deletion) versus Task 4 (Phoneme Identification and Segmentation)"},null,"",null,"",null,"",null,null,null,null,null,23,{"$f":"IF('Input page School-age'!D40=\"\",\"\",'Input page School-age'!D40)","v":""},{"$f":"IF('Input page School-age'!D42=\"\",\"\",'Input page School-age'!D42)","v":""},{"$f":"IF(OR('Input page School-age'!D42=\"\",'Input page School-age'!D40=\"\"),\"\",ABS(U95-V95))","v":""},{"$f":"IF('Input page School-age'!F40=\"\",\"\",'Input page School-age'!F40)","v":""},{"$f":"IF('Input page School-age'!F42=\"\",\"\",'Input page School-age'!F42)","v":""},"",1,null,null,0,11,13,14,0,10,13,14]
[null,null,null,null,null,null,null,null,null,null,null,null,null,null,null,null,null,null,null,24,{"$f":"IF('Input page School-age'!D40=\"\",\"\",'Input page School-age'!D40)","v":""},{"$f":"IF('Input page School-age'!D44=\"\",\"\",'Input page School-age'!D44)","v":""},{"$f":"IF(OR('Input page School-age'!D44=\"\",'Input page School-age'!D40=\"\"),\"\",ABS(U96-V96))","v":""},{"$f":"IF('Input page School-age'!F40=\"\",\"\",'Input page School-age'!F40)","v":""},{"$f":"IF('Input page School-age'!F44=\"\",\"\",'Input page School-age'!F44)","v":""},"",1,null,null,0,7,9,10,0,7,10,11,{"$f":"E83","v":"Recall of Digits Backward (Gsm)"}]
[null,null,null,null,null,null,null,null,null,null,null,null,null,null,null,null,null,null,null,34,{"$f":"IF('Input page School-age'!D42=\"\",\"\",'Input page School-age'!D42)","v":""},{"$f":"IF('Input page School-age'!D44=\"\",\"\",'Input page School-age'!D44)","v":""},{"$f":"IF(OR('Input page School-age'!D44=\"\",'Input page School-age'!D42=\"\"),\"\",ABS(U97-V97))","v":""},{"$f":"IF('Input page School-age'!F42=\"\",\"\",'Input page School-age'!F42)","v":""},{"$f":"IF('Input page School-age'!F44=\"\",\"\",'Input page School-age'!F44)","v":""},"",1,null,null,0,9,11,12,0,9,12,13]
[null,null,"Rapid Naming (Ability Score Comparisons)",null,null,null,null,null,null,null,null,null,null,null,null,null,null,null,null,null,null,null,null,null,null,null,null,null,null,0,8,10,11,0,9,11,12,{"$f":"E84","v":"Phonological Processing (Ga)"}]
[null,null,null,null,null,null,null,{"$f":"'Input page School-age'!C47&\" versus \"&'Input page School-age'!C49","v":"Simple Naming versus Complex Naming"},null,{"$f":"IF(AA101=1,\"\",W101)","v":""},null,{"$f":"IF(J99=\"\",\"\",Z101)","v":""},null,{"$f":"IF(AA101=1,\"\",IF(J99=\"\",\"\",IF(J99>=L99,\"Yes\",\"No\")))","v":""},null,null,null,null,null,null,null,null,null,null,null,null,null,null,null,0,7,9,10,0,8,9,10]
[null,null,null,null,null,null,null,null,null,null,null,null,null,null,null,null,null,null,null,null,null,null,null,null,null,null,null,null,null,0,10,12,13,0,10,13,14,{"$f":"E85","v":"Rapid Naming (Gs)"}]
[null,null,null,null,null,null,null,null,null,null,null,null,null,null,null,null,null,null,null,null,{"$f":"IF('Input page School-age'!D47=\"\",\"\",'Input page School-age'!D47)","v":""},{"$f":"IF('Input page School-age'!D49=\"\",\"\",'Input page School-age'!D49)","v":""},{"$f":"IF(OR('Input page School-age'!D47=\"\",'Input page School-age'!D49=\"\"),\"\",ABS(U101-V101))","v":""},{"$f":"IF('Input page School-age'!F47=\"\",\"\",'Input page School-age'!F47)","v":""},{"$f":"IF('Input page School-age'!F49=\"\",\"\",'Input page School-age'!F49)","v":""},{"$f":"IF(OR(X101=\"\",Y101=\"\"),\"\",1.65*SQRT(X101^2+Y101^2))","v":""},{"$f":"IF(U101=\"\",1,IF(V101=\"\",1, IF(Y101=\"\",1,IF(Z101=\"\",1,0))))","v":1},null,null,0,10,12,13,0,10,13,14]
[null,null,null,null,null,null,null,null,null,null,null,null,null,null,null,null,null,null,null,null,null,null,null,null,null,null,null,null,null,">15",15,10,"<10",">15",15,10,"<10"]
[]
[]
[null,null,null,null,null,null,null,null,null,null,null,null,null,null,null,null,null,null,null,null,"GCA",{"$f":"gca","v":80}]
[null,null,null,null,null,null,null,null,null,null,null,null,null,null,null,null,null,null,null,null,"SNC",{"$f":"snc","v":58}]
[]
[null,null,null,null,null,null,null,null,null,null,null,null,null,null,null,null,null,null,null,null,"Verbal",{"$f":"verb","v":100}]
[null,null,null,null,null,null,null,null,null,null,null,null,null,null,null,null,null,null,null,null,"Nonverbal Reasoning",{"$f":"nverb","v":74}]
[null,null,null,null,null,null,null,null,null,null,null,null,null,null,null,null,null,null,null,null,"Spatial",{"$f":"sp","v":91}]
[null,null,null,null,null,null,null,null,null,null,null,null,null,null,null,null,null,null,null,null,"Working Memory",{"$f":"wm","v":89}]
[null,null,null,null,null,null,null,null,null,null,null,null,null,null,null,null,null,null,null,null,"Processing Speed",{"$f":"ps","v":""}]
[null,null,null,null,null,null,null,null,null,null,null,null,null,null,null,null,null,null,null,null,null,null,null,null,null,"sum sub","n to use",null,null,"sum r","sumc","n","mult","add","rel","Sem",".05 Sem","See",".05 SEe"]
[null,null,null,null,null,null,null,null,null,null,null,null,null,null,null,null,null,null,null,null,{"$f":"E70","v":"Word Definition (Gc)"},43,{"$f":"IF(V114=\"\",0,1)","v":1},"f&thypotheses",null,{"$f":"V115+V117+V119+V116","v":147},{"$f":"IF(SUM(W115+W117+W119+W116)<4,\"\",Z114)","v":147},{"$f":"IF(AA114=\"\",\"\",AA114*AG114+AH114)","v":75.604772625694437},{"$f":"IF(Z114=\"\",\"\",100+(AI114*(AB114-100)))","v":76.684410748662771},3.53,3.31,4,0.46028730894916176,7.9425382101676547,0.95574387947269301,3.1555708071035378,6.1849187819229341,3.0159174851319119,5.9111982708585469]
[null,null,null,null,null,null,null,null,null,null,null,null,null,null,null,null,null,null,null,null,"Verbal Similarities (Gc)",40,1,"u of verb med",null,{"$f":"V116+V119+V117","v":107},{"$f":"IF(SUM(W116+W119+W117)<3,\"\",Z115)","v":107},{"$f":"IF(AA115=\"\",\"\",AA115*AG115+AH115)","v":74.816980895462279},{"$f":"IF(AA115=\"\",\"\",100+(AI115*(AB115-100)))","v":75.85347710860637},2.73,1.78,3,0.58565160708227271,12.152258937659099,0.95884146341463405,3.0431350170025873,5.9645446333250707,2.9178840330710782,5.7190527048193136]
[null,null,null,null,null,null,null,null,null,null,null,null,null,null,null,null,null,null,null,null,"Matrices (Gf)",27,1,"Verbal comp",null,{"$f":"V114+V125","v":80},{"$f":"IF(SUM(W114+W125)<2,\"\",Z116)","v":80},{"$f":"IF(AA116=\"\",\"\",AA116*AG116+AH116)","v":82.621466609095236},{"$f":"IF(AA116=\"\",\"\",100+(AI116*(AB116-100)))","v":84.021080036550657},1.76,0.49,2,0.86892666954523834,13.107333045476167,0.91946308724832226,4.2568539285636158,8.3434336999846863,3.914020055122251,7.6714793080396122]
[null,null,null,null,null,null,null,null,null,null,null,null,null,null,null,null,null,null,null,null,"Sequential & Quantitative Reasoning (Gf)",41,1,"Verbal expression",null,{"$f":"V114+V121+V123+V115+V125+V127+V128+V129","v":366},{"$f":"IF(SUM(W114+W121+W123+W115+W125+W127+W128+W129)<8,\"\",Z117)","v":366},{"$f":"IF(AA117=\"\",\"\",AA117*AG117+AH117)","v":90.854867933459388},{"$f":"IF(AA117=\"\",\"\",100+(AI117*(AB117-100)))","v":91.169507525459338},6.93,11.55,8,0.26897447254531226,-7.5897890181249039,0.96559485530546618,2.7822935783756013,5.4532954136161784,2.6865683652289163,5.265673995848676]
[null,null,null,null,null,null,null,null,null,null,null,null,null,null,null,null,null,null,null,null,"Recall of Designs (Gv)",80,1,null,null,null,null,null,null,2.4300000000000002,1.1200000000000001,3,0.65527804249577848,1.7082936256332317,0.89122137404580148,4.9472407299114387,9.6965918306264189,4.4090866810470262,8.6418098948521713]
[null,null,null,null,null,null,null,null,null,null,null,null,null,null,null,null,null,null,null,null,"Pattern Construction (Gv)",39,1,"vis anal fig and des",null,{"$f":"V119+V116+V118","v":146},{"$f":"IF(SUM(W119+W116+W118)<3,\"\",Z119)","v":146},{"$f":"IF(AA119=\"\",\"\",AA119*AG119+AH119)","v":97.590342013292499},{"$f":"IF(AA119=\"\",\"\",100+(AI119*(AB119-100)))","v":97.71471145776772},2.68,1.6,3,0.60241449667687419,9.6378254984688709,0.94838709677419364,3.407771005482386,6.6792311707454761,3.2318860503607145,6.3344966587070006]
[null,null,null,null,null,null,null,null,null,null,null,null,null,null,null,null,null,null,null,null,null,null,null,null,null,null,null,null,null,1.83,0.55000000000000004,2,0.85194275137059716,14.805724862940281,0.94516129032258067,3.5126499508802964,6.8847939037253809,3.3200207600255704,6.5072406896501178]
[null,null,null,null,null,null,null,null,null,null,null,null,null,null,null,null,null,null,null,null,{"$f":"E77","v":"Recall of Objects-Immediate (Glr)"},{"$f":"F77","v":59},{"$f":"IF(V121=\"\",0,1)","v":1},"vis verb int",null,{"$f":"V117+V121+V125+V116+V129","v":208},{"$f":"IF(SUM(W117+W121+W125+W116+W129)<5,\"\",Z121)","v":208},{"$f":"IF(AA121=\"\",\"\",AA121*AG121+AH121)","v":82.472931151648311},{"$f":"IF(AA121=\"\",\"\",100+(AI121*(AB121-100)))","v":83.354710931170644},4.3499999999999996,3.96,5,0.41731116305599292,-4.3277907639982232,0.94969040247678016,3.364470157799659,6.5943615092873316,3.1952050182818743,6.2626018358324735]
[null,null,null,null,null,null,null,null,null,null,null,null,null,null,null,null,null,null,null,null,"Recall of Objects-Delayed (Glr)",60,1,"stme gen",null,{"$f":"V118+V123+V124+V121+V125+V127","v":309},{"$f":"IF(SUM(W118+W123+W124+W121+W125+W127)<6,\"\",Z122)","v":309},103.17669043601133,{"$f":"IF(AA122=\"\",\"\",100+(AL122*(AB122-100)))","v":109.53005525796735},5.21,6.03,6,0.35296560400125876,-5.8896812003776233,0.95625692137320051,3.1372269109884106,6.1489647455372847,2.9999949475509333,5.8799900971998289]
[null,null,null,null,null,null,null,null,null,null,null,null,null,null,null,null,null,null,null,null,"Recall of Digits Forward (Gsm)",40,1,"aud stm",null,{"$f":"V123+V125+V127","v":127},{"$f":"IF(SUM(W123+W125+W127)<3,\"\",Z123)","v":127},86.341319202480548,{"$f":"IF(AA123=\"\",\"\",100+(AI123*(AB123-100)))","v":86.855125376681912},2.76,1.69,3,0.59385568684867185,10.921646972699222,0.96238244514106597,2.9092868272585561,5.7022021814267703,2.7998465704337834,5.487699278050215]
[null,null,null,null,null,null,null,null,null,null,null,null,null,null,null,null,null,null,null,null,"Recognition of Pictures (Gv)",43,1,"vis stm",null,{"$f":"V121+V124","v":102},{"$f":"IF(SUM(W121+W124)<2,\"\",Z124)","v":102},101.81236627999053,101.53455831006497,1.58,0.37,2,0.90618313999526545,9.3816860004734508,0.84671532846715336,5.8727379555783426,11.510566392933551,4.9725372470590354,9.7461730042357093]
[null,null,null,null,null,null,null,null,null,null,null,null,null,null,null,null,null,null,null,null,"Recall of Sequential Order (Gsm)",37,1,"ver ltr",null,{"$f":"V115+V114+V129","v":127},{"$f":"IF(SUM(W114+W115+W129)<3,\"\",Z125)","v":127},85.180981104229261,86.712097447703727,2.44,1.21,3,0.64430516938133664,3.3542245927995111,0.89667896678966785,4.8215383927046283,9.4502152497010705,4.3233720643071019,8.4738092460419203]
[null,null,null,null,null,null,null,null,null,null,null,null,null,null,null,null,null,null,null,null,"Speed of Information Processing (Gs)","",0,"k q con",null,{"$f":"V117+V126","v":{"$error":"#VALUE!"}},{"$f":"IF(SUM(W117+W126)<2,\"\",Z126)","v":""},"","",1.83,0.3,2,0.93026050941906324,6.9739490580936803,0.93461538461538463,3.8355623396756906,7.5177021857643531,3.5847755713122802,7.0261601197720687]
[null,null,null,null,null,null,null,null,null,null,null,null,null,null,null,null,null,null,null,null,"Recall of Digits Backward (Gsm)",50,1,"hol inf proc",null,{"$f":"V118+V119+V124","v":162},{"$f":"IF(SUM(W118+W119+W124)<3,\"\",Z127)","v":162},107.51305484016713,106.95023017444032,2.57,1.37,3,0.62608790334726172,6.086814497910737,0.92508710801393734,4.1055329370087996,8.0468445565372466,3.797975591553437,7.4440321594447365]
[null,null,null,null,null,null,null,null,null,null,null,null,null,null,null,null,null,null,null,null,"Phonological Processing (Ga)",53,1,"seq info proc",null,{"$f":"V121+V125+V126+V123+V127+V129","v":{"$error":"#VALUE!"}},{"$f":"IF(SUM(W121+W125+W126+W123+W127+W129)<6,\"\",Z128)","v":""},"","",5.4,5.69,6,0.35980431966068754,-7.9412958982062634,0.96547756041426924,2.7870322758786665,5.4625832607221865,2.6908171225111635,5.2740015601218806]
[null,null,null,null,null,null,null,null,null,null,null,null,null,null,null,null,null,null,null,null,"Rapid Naming (Gs)",44,1]
[]
[]
[]
[]
[]
[]
[]
[]
[]
[]
[]
[]
[]
[]
[]
[]
[]
[]
[]
[]
[]
[]
[]
[]
[]
[]
[]
[]
[]
[]
[]
[]
[]
[]
[]
[]
[]
[]
[]
[]
[]
[]
[]
[]
[]
[]
[]
[]
[]
[]
[]
[]
[]
[]
[]
[]
[]
[]
[]
[]
[]
[]
[]
[]
[]
[]
[]
[]
[]
[]
[]
[]
[]
[]
[]
[]
[]
[]
[]
[]
[]
[]
[]
[]
[]
[]
[]
[]
[]
[]
[]
[]
[]
[]
[]
[]
[]
[]
[]
[]
[]
[]
[]
[]
[]
[]
[]
[]
[]
[]
[]
[]
[null,null,"sum",20,{"$f":"D242+1","v":21},22,23,24,25,26,27,28,29,30,31,32,33,34,35,36,37,38,39,40,41,42,43,44,45,46,47,48,49,50,51,52,{"$f":"AJ242+1","v":53},54,55,56,57,58,59,60,61,62,63,64,65,66,67,68,69,70,71,72,73,74,75,76,77,78,79,80,81,82,83,84,{"$f":"BP242+1","v":85},86,87,88,89,90,91,92,93,94,95,96,97,98,99,100,101,102,103,104,105,106,107,108,109,110,111,112,113,114,115,116,{"$f":"CV242+1","v":117},118,119,120,121,122,123,124,125,126,127,128,129,130,131,132,133,134,135,136,137,138,139,140,141,142,143,144,145,146,147,148,{"$f":"EB242+1","v":149},150,151,152,153,154,155,156,157,158,159,160,161,162,163,164,165,166,167,168,169,170,171,172,173,174,175,176,177,178,179,180]
[null,null,"wm",33,34,35,36,37,38,39,40,41,42,42,"43 .",44,45,46,47,48,49,50,50,51,52,53,54,55,56,57,58,59,59,60,61,62,63,64,65,66,66,67,68,69,70,70,71,72,72,73,74,74,75,76,76,77,78,78,79,80,81,81,82,83,84,85,85,86,87,88,89,89,90,91,92,93,94,95,96,96,97,98,99,100,101,102,103,104,105,105,106,107,108,109,110,111,112,113,113,114,115,116,117,118,119,119,120,121,122,123,124,124,125,126,127,128,129,129,130,131,132,133,134,134,135,136,137,138,139,139,140,141,142,143,144,144,145,146,147,149,148,149,150,151,152,152,153,154,155,156,157,157,158,159,160,161,162,163,164,165,166,167,168,169]
[null,null,"pr","<0.1","<0.1","<0.1","<0.1","<0.1","<0.1","<0.1","<0.1","<0.1","<0.1","<0.1","<0.1","<0.1","<0.1","<0.1","<0.1","<0.1","<0.1","<0.1","<0.1",0.1,0.1,0.1,0.1,0.1,0.2,0.2,0.3,0.3,0.3,0.4,0.5,1,1,1,1,1,1,1,2,2,2,2,3,3,3,4,4,4,5,5,5,6,7,7,8,9,10,10,12,13,14,16,16,18,19,21,23,23,25,27,30,32,34,37,39,39,42,45,47,50,53,55,58,61,63,63,66,68,70,73,75,77,79,81,81,82,84,86,87,88,90,90,91,92,93,94,95,95,95,96,96,97,97,97,98,98,98,99,99,99,99,99,99,99,99.5,99.5,99.6,99.7,99.7,99.8,99.8,99.8,99.9,99.9,99.9,99.9,99.9,99.9,">99.9",">99.9",">99.9",">99.9",">99.9",">99.9",">99.9",">99.9",">99.9",">99.9",">99.9",">99.9",">99.9",">99.9",">99.9",">99.9",">99.9",">99.9",">99.9",">99.9",">99.9",">99.9"]
[null,null,"90p","31-42","32-43","33-43","34-44","35-45","36-46","37-47","38-48","39-49","40-50","40-50","41-51","42-52","43-53","43-54","44-55","45-56","46-57","47-58","47-58","48-59","49-60","50-61","51-62","52-62","53-63","54-64","55-65","56-66","56-66","57-67","58-68","59-69","60-70","61-71","62-72","62-73","62-73","63-74","64-75","65-76","66-77","66-77","67-78","68-79","68-79","69-80","70-81","70-81","71-81","72-82","72-82","73-83","74-84","74-84","75-85","76-86","77-87","77-87","78-88","79-89","80-90","81-91","81-91","81-92","82-93","83-94","84-95","84-95","85-96","86-97","87-98","88-99","89-100","90-100","91-101","91-101","92-102","93-103","94-104","95-105","96-106","97-107","98-108","99-109","100-110","100-110","100-111","101-112","102-113","103-114","104-115","105-116","106-117","107-118","107-118","108-119","109-119","110-120","111-121","112-122","113-123","113-123","114-124","115-125","116-126","117-127","118-128","118-128","119-129","119-130","120-131","121-132","122-133","122-133","123-134","124-135","125-136","126-137","127-138","127-138","128-138","129-139","130-140","131-141","132-142","132-142","133-143","134-144","135-145","136-146","137-147","137-147","138-148","138-149","139-150","140-151","140-151","141-152","142-153","143-154","144-155","144-155","145-156","146-157","147-157","148-158","149-159","149-159","150-160","151-161","152-162","153-163","154-164","155-165","156-166","157-167","157-168","158-169","159-170","160-171"]
[null,null,"95p","30-43","31-44","32-44","33-45","34-46","35-47","36-48","37-49","38-50","39-51","39-51","40-52","41-53","42-54","42-55","43-56","44-57","45-58","46-59","46-59","47-60","48-61","49-62","50-63","51-63","52-64","53-65","54-66","55-67","55-67","56-68","57-69","58-70","59-71","60-72","61-73","61-74","61-74","62-75","63-76","64-77","65-78","65-78","66-79","67-80","67-80","68-81","69-82","69-82","70-82","71-83","71-83","72-84","73-85","73-85","74-86","75-87","76-88","76-88","77-89","78-90","79-91","80-92","80-92","80-93","81-94","82-95","83-96","83-96","84-97","85-98","86-99","87-100","88-101","89-101","90-102","90-102","91-103","92-104","93-105","94-106","95-107","96-108","97-109","98-110","99-111","99-111","99-112","100-113","101-114","102-115","103-116","104-117","105-118","106-119","106-119","107-120","108-120","109-121","110-122","111-123","112-124","112-124","113-125","114-126","115-127","116-128","117-129","117-129","118-130","118-131","119-132","120-133","121-134","121-134","122-135","123-136","124-137","125-138","126-139","126-139","127-139","128-140","129-141","130-142","131-143","131-143","132-144","133-145","134-146","135-147","136-148","136-148","137-149","137-150","138-151","139-152","139-152","140-153","141-154","142-155","143-156","143-156","144-157","145-158","146-158","147-159","148-160","148-160","149-161","150-162","151-163","152-164","153-165","154-166","155-167","156-168","156-169","157-170","158-171","159-172"]
[]
[]
[]
[]
[]
[]
[]
[null,null,"psss",20,{"$f":"D254+1","v":21},22,23,24,25,26,27,28,29,30,31,32,33,34,35,36,37,38,39,40,41,42,43,44,45,46,47,48,49,50,51,52,{"$f":"AJ254+1","v":53},54,55,56,57,58,59,60,61,62,63,64,65,66,67,68,69,70,71,72,73,74,75,76,77,78,79,80,81,82,83,84,{"$f":"BP254+1","v":85},86,87,88,89,90,91,92,93,94,95,96,97,98,99,100,101,102,103,104,105,106,107,108,109,110,111,112,113,114,115,116,{"$f":"CV254+1","v":117},118,119,120,121,122,123,124,125,126,127,128,129,130,131,132,133,134,135,136,137,138,139,140,141,142,143,144,145,146,147,148,{"$f":"EB254+1","v":149},150,151,152,153,154,155,156,157,158,159,160,161,162,163,164,165,166,167,168,169,170,171,172,173,174,175]
[null,null,null,30,30,30,30,30,31,32,33,34,35,36,37,38,39,39,40,41,42,43,44,45,46,47,48,49,49,50,51,52,53,54,55,56,57,58,59,59,60,61,62,63,64,65,66,67,68,69,69,70,71,72,73,74,75,76,77,78,79,79,80,81,82,83,84,85,86,87,88,89,89,90,91,92,93,94,95,96,97,98,99,100,101,102,103,104,105,106,107,108,109,109,110,111,112,113,114,115,116,117,118,119,119,120,121,122,123,124,125,126,127,128,129,129,130,131,132,133,134,135,136,137,138,139,139,140,141,142,143,144,145,146,147,148,149,149,150,151,152,153,154,155,156,157,158,159,160,161,162,163,164,165,166,167,168,169,170]
[]
[null,null,"gcasum",60,63,64,67,69,70,73,75,77,80,81,83,86,87,90,93,94,98,99,101,105,108,111,112,115,117,119,123,127,129,131,134,135,138,141,145,147,148,152,153,155,158,159,161,165,169,171,174,177,181,183,184,188,189,191,195,199,201,202,206,207,210,213,214,218,219,222,225,228,231,232,236,237,240,243,244,246,249,252,255,258,261,265,267,268,272,273,274,277,279,280,283,285,286,289,291,294,297,300,303,307,309,310,313,315,317,320,321,323,326,327,328,331,333,334,337,339,340,343,345,346,349,351,352,355,357,358,361,363,366,369,371,373,375,376,378,381,384,386,387,389,392,393,395,398,399,401,404,405,408,411,414,417,420,423,426,429,432,435,437,440,441,443,446,447,448,451,453,454,457,459,460,463,465,466,469,471,472,475,477,478,481,483,484,487,489,490,493,495,496,499,501,502,505,507,513,519,525,531,537]
[null,null,null,30,30,31,32,32,33,34,34,35,36,36,37,38,38,39,39,40,41,41,42,43,44,44,45,46,46,47,48,49,49,50,51,51,52,53,54,54,55,56,56,57,58,58,59,60,61,61,62,63,64,64,65,66,66,67,68,69,69,70,71,71,72,72,73,74,74,75,76,77,77,78,79,79,80,80,81,82,83,84,85,86,87,88,88,89,90,90,91,92,92,93,94,94,95,96,97,98,99,100,101,102,102,103,104,104,105,106,106,107,108,108,109,110,110,111,112,112,113,114,114,115,116,116,117,118,118,119,120,121,122,123,124,125,125,126,127,128,129,130,130,131,132,132,133,134,134,135,136,136,137,138,139,140,141,142,143,144,145,146,147,148,148,149,150,150,151,152,152,153,154,154,155,156,156,157,158,158,159,160,160,161,162,162,163,164,164,165,166,166,167,168,168,169,170,170,170,170,170,170,170]
[]
[null,null,"t",10,{"$f":"D260+1","v":11},12,13,14,15,16,17,18,19,20,21,22,23,24,25,26,27,28,29,30,31,32,33,34,35,36,37,38,39,40,41,42,{"$f":"AJ260+1","v":43},44,45,46,47,48,49,50,51,52,53,54,55,56,57,58,59,60,61,62,63,64,65,66,67,68,69,70,71,72,73,74,{"$f":"BP260+1","v":75},76,77,78,79,80,81,82,83,84,85,86,87,88,89,90]
[null,null,"PR","<.1","<.1","<.1","<.1","<.1","<.1","<.1","<.1","<.1",0.1,0.1,0.2,0.3,0.4,0.5,1,1,1,1,2,2,3,4,4,5,7,8,10,12,14,16,18,21,24,27,31,34,38,42,46,50,54,58,62,66,69,73,76,79,82,84,86,88,90,92,93,95,96,96,97,98,98,99,99,99,99,99.5,99.7,99.7,99.8,99.9,99.9,99.9,">99.9",">99.9",">99.9",">99.9",">99.9",">99.9",">99.9",">99.9"]
[]
[null,null,"Vts",20,{"$f":"D263+1","v":21},22,23,24,25,26,27,28,29,30,31,32,33,34,35,36,37,38,39,40,41,42,43,44,45,46,47,48,49,50,51,52,{"$f":"AJ263+1","v":53},54,55,56,57,58,59,60,61,62,63,64,65,66,67,68,69,70,71,72,73,74,75,76,77,78,79,80,81,82,83,84,{"$f":"BP263+1","v":85},86,87,88,89,90,91,92,93,94,95,96,97,98,99,100,101,{"$f":"CG263+1","v":102},103,104,105,106,107,108,109,110,111,112,113,114,115,116,117,118,119,120,121,122,123,124,125,126,127,128,129,130,131,132,133,{"$f":"DM263+1","v":134},135,136,137,138,139,140,141,142,143,144,145,146,147,148,149,150,151,152,153,154,155,156,157,158,159,160,161,162,163,164,165,{"$f":"ES263+1","v":166},167,168,169,170,171,172,173,174,175,176,177,178,179,180]
[null,null,"Vcls",31,32,33,34,35,36,37,38,39,40,41,42,43,44,45,45,46,47,48,49,50,51,51,52,53,54,55,56,57,57,58,59,60,61,62,63,63,64,65,66,67,68,69,70,70,71,72,73,73,74,75,76,77,77,78,79,80,80,81,82,83,83,84,85,86,86,87,88,89,89,90,91,92,93,94,95,96,97,98,99,100,101,102,103,103,104,105,106,106,107,108,109,109,110,111,112,113,114,115,116,117,118,119,102,120,121,122,123,123,124,125,126,127,128,128,129,130,131,132,133,133,134,135,136,137,138,138,139,140,141,142,143,143,144,145,146,147,148,148,149,150,151,152,153,153,154,155,156,157,158,159,160,161,162,163,164,165,166,167,168,169]
[null,null,"NVts",20,{"$f":"D265+1","v":21},22,23,24,25,26,27,28,29,30,31,32,33,34,35,36,37,38,39,40,41,42,43,44,45,46,47,48,49,50,51,52,{"$f":"AJ265+1","v":53},54,55,56,57,58,59,60,61,62,63,64,65,66,67,68,69,70,71,72,73,74,75,76,77,78,79,80,81,82,83,84,{"$f":"BP265+1","v":85},86,87,88,89,90,91,92,93,94,95,96,97,98,99,{"$f":"CE265+1","v":100},101,102,103,104,105,106,107,108,109,110,111,112,113,114,115,116,117,118,119,120,121,122,123,124,125,126,127,128,129,130,131,{"$f":"DK265+1","v":132},133,134,135,136,137,138,139,140,141,142,143,144,145,146,147,148,149,150,151,152,153,154,155,156,157,158,159,160,161,162,163,{"$f":"EQ265+1","v":164},165,166,167,168,169,170,171,172,173,174,175,176,177,178,179,180]
[null,null,"NVcls",31,32,33,34,35,36,37,38,39,40,41,42,43,44,45,46,47,48,49,49,50,51,52,53,54,54,55,56,57,58,59,59,60,61,62,63,64,64,65,66,67,68,69,69,70,71,72,73,74,74,75,76,77,78,79,79,80,81,82,83,84,84,85,86,87,88,89,89,90,91,92,93,93,94,95,96,97,97,98,99,100,100,101,102,103,103,104,105,106,107,107,108,109,110,111,111,112,113,114,115,115,116,117,118,119,120,120,121,122,123,123,124,125,126,127,127,128,129,130,131,131,132,133,134,135,135,136,137,138,139,139,140,141,142,143,143,144,145,146,147,147,148,149,150,151,151,152,153,154,155,156,157,158,159,160,161,162,163,164,165,166]
[null,null,"Spts",20,{"$f":"D267+1","v":21},22,23,24,25,26,27,28,29,30,31,32,33,34,35,36,37,38,39,40,41,42,43,44,45,46,47,48,49,50,51,52,{"$f":"AJ267+1","v":53},54,55,56,57,58,59,60,61,62,63,64,65,66,67,68,69,70,71,72,73,74,75,76,77,78,79,80,81,82,83,84,{"$f":"BP267+1","v":85},86,87,88,89,90,91,92,93,94,95,96,97,98,99,100,101,102,{"$f":"CH267+1","v":103},104,105,106,107,108,109,110,111,112,113,114,115,116,117,118,119,120,121,122,123,124,125,126,127,128,129,130,131,132,133,134,{"$f":"DN267+1","v":135},136,137,138,139,140,141,142,143,144,145,146,147,148,149,150,151,152,153,154,155,156,157,158,159,160,161,162,163,164,165,166,{"$f":"ET267+1","v":167},168,169,170,171,172,173,174,175,176,177,178,179,180]
[null,null,"Spcls",32,33,34,35,36,37,38,38,39,40,41,42,43,43,44,45,46,47,48,48,49,50,51,52,53,53,54,55,56,57,58,58,59,60,61,62,63,63,64,65,66,67,68,68,69,70,71,72,73,73,74,75,76,77,78,78,79,80,81,82,83,83,84,85,86,87,88,88,89,90,91,92,93,94,94,95,96,97,98,99,100,100,101,102,103,104,105,106,107,107,108,109,110,111,112,113,114,115,115,116,117,118,119,120,120,121,122,123,124,125,126,126,127,128,129,130,131,132,132,133,134,135,136,137,138,139,139,140,141,142,143,144,145,146,146,147,148,149,150,151,152,153,154,154,155,156,157,158,159,160,161,162,163,164,165,166,167,168,169,170,170]
[null,null,"SumT",120,123,126,130,133,137,140,144,147,150,154,157,161,164,168,171,174,178,181,185,188,192,195,199,202,206,209,213,217,220,224,227,230,233,237,240,244,247,250,253,256,259,262,265,268,271,274,277,280,283,286,289,292,295,298,300,303,307,310,313,316,320,323,326,329,332,335,338,340,343,346,348,351,354,356,359,362,365,368,371,374,377,379,382,385,388,390,393,396,398,401,404,406,409,412,415,417,420,423,425,428,431,433,436,439,442,444,447,450,453,455,458,461,463,466,469,471,474,477,480]
[null,null,"GCA",45,46,47,48,49,50,51,52,53,54,55,56,57,58,59,60,61,62,63,64,65,66,67,68,69,70,71,72,73,74,75,76,77,78,79,80,81,82,83,84,85,86,87,88,89,90,91,92,93,94,95,96,97,98,99,100,101,102,103,104,105,106,107,108,109,110,111,112,113,114,115,116,117,118,119,120,121,122,123,124,125,126,127,128,129,130,131,132,133,134,135,136,137,138,139,140,141,142,143,144,145,146,147,148,149,150,151,152,153,154,155,156,157,158,159,160,161,162,163,164]
[null,null,"SS",40,62,68,71,73,75,77,78,79,80,81,82,83,84,85,86,87,88,89,90,91,92,93,94,95,96,97,98,99,100,101,102,103,104,105,106,107,108,109,110,111,112,113,114,115,116,117,118,119,120,121,122,123,124,126,129,131,133]
[null,null,"%ile",1,1,2,3,4,5,6,7,8,9,10,12,13,14,16,18,19,21,23,25,27,30,32,34,37,39,42,45,47,50,53,55,58,61,63,66,68,70,73,75,77,79,81,82,84,86,87,88,90,91,92,93,94,95,96,97,98,99]
[null,null,"verbal",51,57,65,72,81,88,97,104,113,120,129,136,144]
[null,null,"-",7,8,8,9,9,10,10,11,11,12,12,13,13]
[null,null,"+",13,13,12,12,11,11,10,10,9,9,8,8,7]
[null,null,"Nverbal",52,58,65,77,85,97,104,116,124,136,143]
[null,null,"-",7,7,8,8,9,9,10,10,11,11,12]
[null,null,"+",12,11,11,10,10,9,9,8,8,7,7]
[null,null,"Spatial",50,53,54,76,78,100,101,123,125,147,148]
[null,null,"-",6,6,7,7,8,8,9,9,10,10,11]
[null,null,"+",11,10,10,9,9,8,8,7,7,6,6]
[null,null,"GCA",44,57,62,98,103,139,144]
[null,null,"-",5,5,6,6,7,7,8]
[null,null,"+",8,7,7,6,6,5,5]
[null,null,null,1,70,80,90,110,120,130]
[null,null,null,"Very Low","Low","Below average","Average","Above average","High","Very High"]
[null,null,"GCAV",0,11,13,15,18,20,23]
[null,null,"GCAnv",0,9,11,13,16,19,22]
[null,null,"GCAsp",0,10,13,15,17,21,23]
[null,null,"Vnv",0,15,19,22,26,32,26]
[null,null,"Vsp",0,17,21,24,28,34,37]
[null,null,"Nvsp",0,14,19,21,25,30,34]
[null,null,"WS",0,9,11,13,16,19,22]
[null,null,"MSEQ",0,10,13,15,18,20,23]
[null,null,"RDPC",0,10,13,15,18,23,25]
[null,null,"%",50,25,10,10,5,2,1]
[null,null,"SNvCompT",80,82,85,87,90,92,95,97,99,102,104,107,109]
[null,null,"SNvComp",48,{"$f":"D298+1","v":49},50,51,52,53,54,55,56,57,58,59,60]
[null,null,"snvcomp",48,49,83,84,117,118,152,153,159,160]
[null,null,"-",6,6,7,7,8,8,9,9,9,11]
[null,null,"+",9,8,8,7,7,6,6,5,5,5,null,null,null,111,114,116,119,121,124,126,129,131,134,136,139,142,144,147,149,151,153,156,158,160,162,165,167,169,171,173,175,177,179,181,183,186,188,190,192,194,196,198,200,203,205,207,209,212,214,216,218,221,223,225,227,229,231,233,235,237,239,241,243,245,247,249,252,254,256,258,260,262,264,265,267,269,271,272,274,276,278,280,281,283,285,286,288,290,292,293,295,297,299,300,302,304,306,307,309,311,312,314,316,318,319]
[null,null,null,null,null,null,null,null,null,null,null,null,null,null,null,null,{"$f":"P298+1","v":61},{"$f":"Q302+1","v":62},63,64,65,66,67,68,69,70,71,72,73,74,75,76,77,78,79,80,81,82,83,84,85,86,87,88,89,90,91,92,93,{"$f":"AW302+1","v":94},95,96,97,98,99,100,101,102,103,104,105,106,107,108,109,110,111,112,113,114,115,116,117,118,119,120,121,122,123,124,125,{"$f":"CC302+1","v":126},127,128,129,130,131,132,133,134,135,136,137,138,139,140,141,142,143,144,145,146,147,148,149,150,151,152,153,154,155,156,157,158,159,160,161,162]
[null,null,"iq","m","mllf","nvoc","nvtable","pc","psim","rd","rdig","ro","rod","rop","s","sip"]
[]
[null,null,"Recall    Designs","Word     Def.","Pattern Con.","        Matrices","              Simil.","Seq. & Quant.","Recall   Digits","Recall    Objects","Recall    Objects delayed","Speed of Info. Process.","Verbal Cluster:","Nonverbal Reasoning:","Spatial Cluster:","GCA:"]
[null,null,42,37,50,38,49,47,42,59,52,null,{"$f":"C25","v":0},{"$f":"C26","v":0},{"$f":"C27","v":0},{"$f":"C28","v":"RObI"}]
["gca",null,null,null,null,null,null,null,null,null,null,null,null,null,null,null,"snvc","Sptable","sq","vc","vtable","wd"]
[]
["Age",null,null,null,null,null,null,null,null,null,null,null,null,null,null,null,"v%","NV%","S%","GCA%","vi","nvi","si","gcai"]
[{"$f":"H4","v":0},null,null,null,null,null,null,null,null,null,null,null,null,null,null,null,{"$f":"E25","v":0},{"$f":"E26","v":0},{"$f":"E27","v":0},{"$f":"E28","v":0},{"$f":"G25","v":0},{"$f":"G26","v":0},{"$f":"G27","v":0},{"$f":"G28","v":0}]

{"sheet":"Shared Abilities SA","index":7,"n_rows":88,"n_cols":19,"rows_kept":88,"cut":false,"hidden":false,"merged":[[0,0,1,9],[2,0,3,0],[2,2,3,9]]}
["Note: Shared Ability Standard Scores (SS) are computed only when all the subtests in the shared ability are administered. The Shared Ability subtest designation of High, Low, +, - , and = are given only if there is an appropriate mean score available."]
[]
["School-Age Shared Ability",null,"Shared Ability Subtests (includes out-of-level subtests) "]
[]
[]
["Formulation and Testing of Hypotheses ",null,"VS","SQR","PC","Mat"]
[{"$f":"\"SS = \"&J73","v":"SS = 76"},null,{"$f":"J56","v":"-"},{"$f":"J58","v":"-"},{"$f":"J60","v":"Low"},{"$f":"J57","v":"Low"}]
[]
["Use of Verbal Mediation to Solve Nonverbal Problems",null,"SQR","PC","Mat"]
[{"$f":"\"SS = \"&J74","v":"SS = 75"},null,{"$f":"J58","v":"-"},{"$f":"J60","v":"Low"},{"$f":"J57","v":"Low"}]
[]
["Verbal Comprehension:",null,"WD","RSO"]
[{"$f":"\"SS = \"&J75","v":"SS = 83"},null,{"$f":"J55","v":"-"},{"$f":"J66","v":"Low"}]
[]
["Verbal Expression:",null,"WD","VS","ROi","RDf","RSO","RDb","PhP","RN"]
[{"$f":"\"SS = \"&J76","v":"SS = 91"},null,{"$f":"J55","v":"-"},{"$f":"J56","v":"-"},{"$f":"J62","v":"High"},{"$f":"J64","v":"-"},{"$f":"J66","v":"Low"},{"$f":"J68","v":"+"},{"$f":"J69","v":"+"},{"$f":"J70","v":"-"}]
[]
["Visual Analysis of Figures or Designs:",null,"PCon","Mat","RDes"]
[{"$f":"\"SS = \"&J78","v":"SS = 98"},null,{"$f":"J60","v":"Low"},{"$f":"J57","v":"Low"},{"$f":"J59","v":"High"}]
[]
["Visual Verbal Integration:",null,"SQR","Mat","ROi","RSO"]
[{"$f":"\"SS = \"&J80","v":"SS = 82"},null,{"$f":"J58","v":"-"},{"$f":"J57","v":"Low"},{"$f":"J62","v":"High"},{"$f":"J66","v":"Low"}]
[]
["Short-term Memory (general):",null,"RDes","ROi","RDf","RPic","RSO","RDb"]
[{"$f":"\"SS = \"&J80","v":"SS = 82"},null,{"$f":"J59","v":"High"},{"$f":"J62","v":"High"},{"$f":"J64","v":"-"},{"$f":"J65","v":"-"},{"$f":"J66","v":"Low"},{"$f":"J68","v":"+"}]
[]
["Auditory Short-term Memory:",null,"RDf","RSO","RDb"]
[{"$f":"\"SS = \"&J82","v":"SS = 86"},null,{"$f":"J64","v":"-"},{"$f":"J66","v":"Low"},{"$f":"J68","v":"+"}]
[]
["Visual Short-term Memory:",null,"ROi","RPic"]
[{"$f":"\"SS = \"&J83","v":"SS = 102"},null,{"$f":"J62","v":"High"},{"$f":"J65","v":"-"}]
[]
["Verbal Long-term Information Retrieval:",null,"WD","VS","RN"]
[{"$f":"\"SS = \"&J84","v":"SS = 85"},null,{"$f":"J55","v":"-"},{"$f":"J56","v":"-"},{"$f":"J70","v":"-"}]
[]
["Knowledge of Quantitative Concepts:",null,"SQR","SIP"]
[{"$f":"\"SS = \"&J85","v":"SS = "},null,{"$f":"J58","v":"-"},{"$f":"J67","v":""}]
[]
["Visual/holistic Information Processing:",null,"PC","RDes","RPic"]
[{"$f":"\"SS = \"&J86","v":"SS = 108"},null,{"$f":"J60","v":"Low"},{"$f":"J59","v":"High"},{"$f":"J65","v":"-"}]
[]
["Sequential Information Processing:",null,"ROi","RDf","RSO","SIP","RDb","RN"]
[{"$f":"\"SS = \"&J87","v":"SS = "},null,{"$f":"J62","v":"High"},{"$f":"J64","v":"-"},{"$f":"J66","v":"Low"},{"$f":"J67","v":""},{"$f":"J68","v":"+"},{"$f":"J70","v":"-"}]
[]
[]
[]
[]
[]
[]
[]
[]
[]
[null,null,{"$f":"IF('Record form School-age'!F68=\"\",\"\",'Record form School-age'!F68)","v":45}]
[null,null,null,null,null,null,null,null,null,"choice"]
[{"$f":"'Record form School-age'!E70","v":"Word Definition (Gc)"},null,{"$f":"'Record form School-age'!F70","v":43},{"$f":"'Record form School-age'!G70","v":0},{"$f":"'Record form School-age'!H70","v":7},{"$f":"'Record form School-age'!I70","v":0},{"$f":"'Record form School-age'!J70","v":-2},{"$f":"IF(OR(samtyn=\"\",C55=\"\"),\"\",IF(G55<0,\"-\",IF(G55>0,\"+\",\"=\")))","v":"-"},{"$f":"'Record form School-age'!L70","v":""},{"$f":"IF(I55=\"High\",I55,IF(I55=\"Low\",I55,H55))","v":"-"},{"$f":"'Record form School-age'!N70","v":""}]
[{"$f":"'Record form School-age'!E71","v":"Verbal Similarities (Gc)"},null,{"$f":"'Record form School-age'!F71","v":40},{"$f":"'Record form School-age'!G71","v":0},{"$f":"'Record form School-age'!H71","v":8},{"$f":"'Record form School-age'!I71","v":0},{"$f":"'Record form School-age'!J71","v":-5},"-",{"$f":"'Record form School-age'!L71","v":""},"-",{"$f":"'Record form School-age'!N71","v":""}]
[{"$f":"'Record form School-age'!E72","v":"Matrices (Gf)"},null,{"$f":"'Record form School-age'!F72","v":27},{"$f":"'Record form School-age'!G72","v":0},{"$f":"'Record form School-age'!H72","v":7},{"$f":"'Record form School-age'!I72","v":0},{"$f":"'Record form School-age'!J72","v":-18},"-",{"$f":"'Record form School-age'!L72","v":"Low"},"Low",{"$f":"'Record form School-age'!N72","v":"<10%"}]
[{"$f":"'Record form School-age'!E73","v":"Sequential & Quantitative Reasoning (Gf)"},null,{"$f":"'Record form School-age'!F73","v":41},{"$f":"'Record form School-age'!G73","v":0},{"$f":"'Record form School-age'!H73","v":6},{"$f":"'Record form School-age'!I73","v":0},{"$f":"'Record form School-age'!J73","v":-4},"-",{"$f":"'Record form School-age'!L73","v":""},"-",{"$f":"'Record form School-age'!N73","v":""}]
[{"$f":"'Record form School-age'!E74","v":"Recall of Designs (Gv)"},null,{"$f":"'Record form School-age'!F74","v":80},{"$f":"'Record form School-age'!G74","v":0},{"$f":"'Record form School-age'!H74","v":7},{"$f":"'Record form School-age'!I74","v":0},{"$f":"'Record form School-age'!J74","v":35},"+",{"$f":"'Record form School-age'!L74","v":"High"},"High",{"$f":"'Record form School-age'!N74","v":"<10%"}]
[{"$f":"'Record form School-age'!E75","v":"Pattern Construction (Gv)"},null,{"$f":"'Record form School-age'!F75","v":39},{"$f":"'Record form School-age'!G75","v":0},{"$f":"'Record form School-age'!H75","v":5},{"$f":"'Record form School-age'!I75","v":0},{"$f":"'Record form School-age'!J75","v":-6},"-",{"$f":"'Record form School-age'!L75","v":"Low"},"Low",{"$f":"'Record form School-age'!N75","v":"15%"}]
[null,null,null,null,null,null,null,"",null,""]
[{"$f":"'Record form School-age'!E77","v":"Recall of Objects-Immediate (Glr)"},null,{"$f":"'Record form School-age'!F77","v":59},{"$f":"'Record form School-age'!G77","v":0},{"$f":"'Record form School-age'!H77","v":9},{"$f":"'Record form School-age'!I77","v":0},{"$f":"'Record form School-age'!J77","v":14},"+",{"$f":"'Record form School-age'!L77","v":"High"},"High",{"$f":"'Record form School-age'!N77","v":"<10%"}]
[{"$f":"'Record form School-age'!E78","v":"Recall of Objects-Delayed (Glr)"},null,{"$f":"'Record form School-age'!F78","v":60},{"$f":"'Record form School-age'!G78","v":0},{"$f":"'Record form School-age'!H78","v":0},{"$f":"'Record form School-age'!I78","v":0},{"$f":"'Record form School-age'!J78","v":0},"=",{"$f":"'Record form School-age'!L78","v":""},"=",{"$f":"'Record form School-age'!N78","v":0}]
[{"$f":"'Record form School-age'!E79","v":"Recall of Digits Forward (Gsm)"},null,{"$f":"'Record form School-age'!F79","v":40},{"$f":"'Record form School-age'!G79","v":0},{"$f":"'Record form School-age'!H79","v":7},{"$f":"'Record form School-age'!I79","v":0},{"$f":"'Record form School-age'!J79","v":-5},"-",{"$f":"'Record form School-age'!L79","v":""},"-",{"$f":"'Record form School-age'!N79","v":""}]
[{"$f":"'Record form School-age'!E80","v":"Recognition of Pictures (Gv)"},null,{"$f":"'Record form School-age'!F80","v":43},{"$f":"'Record form School-age'!G80","v":0},{"$f":"'Record form School-age'!H80","v":13},{"$f":"'Record form School-age'!I80","v":0},{"$f":"'Record form School-age'!J80","v":-2},"-",{"$f":"'Record form School-age'!L80","v":""},"-",{"$f":"'Record form School-age'!N80","v":""}]
[{"$f":"'Record form School-age'!E81","v":"Recall of Sequential Order (Gsm)"},null,{"$f":"'Record form School-age'!F81","v":37},{"$f":"'Record form School-age'!G81","v":0},{"$f":"'Record form School-age'!H81","v":7},{"$f":"'Record form School-age'!I81","v":0},{"$f":"'Record form School-age'!J81","v":-8},"-",{"$f":"'Record form School-age'!L81","v":"Low"},"Low",{"$f":"'Record form School-age'!N81","v":"15%"}]
[{"$f":"'Record form School-age'!E82","v":"Speed of Information Processing (Gs)"},null,{"$f":"'Record form School-age'!F82","v":""},{"$f":"'Record form School-age'!G82","v":0},{"$f":"'Record form School-age'!H82","v":""},{"$f":"'Record form School-age'!I82","v":0},{"$f":"'Record form School-age'!J82","v":""},"",{"$f":"'Record form School-age'!L82","v":""},"",{"$f":"'Record form School-age'!N82","v":""}]
[{"$f":"'Record form School-age'!E83","v":"Recall of Digits Backward (Gsm)"},null,{"$f":"'Record form School-age'!F83","v":50},{"$f":"'Record form School-age'!G83","v":0},{"$f":"'Record form School-age'!H83","v":7},{"$f":"'Record form School-age'!I83","v":0},{"$f":"'Record form School-age'!J83","v":5},"+",{"$f":"'Record form School-age'!L83","v":""},"+",{"$f":"'Record form School-age'!N83","v":""}]
[{"$f":"'Record form School-age'!E84","v":"Phonological Processing (Ga)"},null,{"$f":"'Record form School-age'!F84","v":53},{"$f":"'Record form School-age'!G84","v":0},{"$f":"'Record form School-age'!H84","v":9},{"$f":"'Record form School-age'!I84","v":0},{"$f":"'Record form School-age'!J84","v":8},"+",{"$f":"'Record form School-age'!L84","v":""},"+",{"$f":"'Record form School-age'!N84","v":""}]
[{"$f":"'Record form School-age'!E85","v":"Rapid Naming (Gs)"},null,{"$f":"'Record form School-age'!F85","v":44},{"$f":"'Record form School-age'!G85","v":0},{"$f":"'Record form School-age'!H85","v":10},{"$f":"'Record form School-age'!I85","v":0},{"$f":"'Record form School-age'!J85","v":-1},"-",{"$f":"'Record form School-age'!L85","v":""},"-",{"$f":"'Record form School-age'!N85","v":""}]
[]
[]
[{"$f":"'Record form School-age'!U114","v":"Word Definition (Gc)"},null,{"$f":"'Record form School-age'!V114","v":43},{"$f":"'Record form School-age'!W114","v":1},{"$f":"'Record form School-age'!X114","v":"f&thypotheses"},{"$f":"'Record form School-age'!Y114","v":0},{"$f":"'Record form School-age'!Z114","v":147},{"$f":"'Record form School-age'!AA114","v":147},{"$f":"ROUND('Record form School-age'!AB114,0)","v":76},{"$f":"IF(H73=\"\",\"\",I73)","v":76},{"$f":"'Record form School-age'!AD114","v":3.53},{"$f":"'Record form School-age'!AE114","v":3.31},{"$f":"'Record form School-age'!AF114","v":4},{"$f":"'Record form School-age'!AG114","v":0.46028730894916176},{"$f":"'Record form School-age'!AH114","v":7.9425382101676547},{"$f":"'Record form School-age'!AI114","v":0.95574387947269301},{"$f":"'Record form School-age'!AJ114","v":3.1555708071035378},{"$f":"'Record form School-age'!AK114","v":6.1849187819229341},{"$f":"'Record form School-age'!AL114","v":3.0159174851319119}]
[{"$f":"'Record form School-age'!U115","v":"Verbal Similarities (Gc)"},null,{"$f":"'Record form School-age'!V115","v":40},{"$f":"'Record form School-age'!W115","v":1},{"$f":"'Record form School-age'!X115","v":"u of verb med"},{"$f":"'Record form School-age'!Y115","v":0},{"$f":"'Record form School-age'!Z115","v":107},{"$f":"'Record form School-age'!AA115","v":107},{"$f":"ROUND('Record form School-age'!AB115,0)","v":75},75,{"$f":"'Record form School-age'!AD115","v":2.73},{"$f":"'Record form School-age'!AE115","v":1.78},{"$f":"'Record form School-age'!AF115","v":3},{"$f":"'Record form School-age'!AG115","v":0.58565160708227271},{"$f":"'Record form School-age'!AH115","v":12.152258937659099},{"$f":"'Record form School-age'!AI115","v":0.95884146341463405},{"$f":"'Record form School-age'!AJ115","v":3.0431350170025873},{"$f":"'Record form School-age'!AK115","v":5.9645446333250707},{"$f":"'Record form School-age'!AL115","v":2.9178840330710782}]
[{"$f":"'Record form School-age'!U116","v":"Matrices (Gf)"},null,{"$f":"'Record form School-age'!V116","v":27},{"$f":"'Record form School-age'!W116","v":1},{"$f":"'Record form School-age'!X116","v":"Verbal comp"},{"$f":"'Record form School-age'!Y116","v":0},{"$f":"'Record form School-age'!Z116","v":80},{"$f":"'Record form School-age'!AA116","v":80},{"$f":"ROUND('Record form School-age'!AB116,0)","v":83},83,{"$f":"'Record form School-age'!AD116","v":1.76},{"$f":"'Record form School-age'!AE116","v":0.49},{"$f":"'Record form School-age'!AF116","v":2},{"$f":"'Record form School-age'!AG116","v":0.86892666954523834},{"$f":"'Record form School-age'!AH116","v":13.107333045476167},{"$f":"'Record form School-age'!AI116","v":0.91946308724832226},{"$f":"'Record form School-age'!AJ116","v":4.2568539285636158},{"$f":"'Record form School-age'!AK116","v":8.3434336999846863},{"$f":"'Record form School-age'!AL116","v":3.914020055122251}]
[{"$f":"'Record form School-age'!U117","v":"Sequential & Quantitative Reasoning (Gf)"},null,{"$f":"'Record form School-age'!V117","v":41},{"$f":"'Record form School-age'!W117","v":1},{"$f":"'Record form School-age'!X117","v":"Verbal expression"},{"$f":"'Record form School-age'!Y117","v":0},{"$f":"'Record form School-age'!Z117","v":366},{"$f":"'Record form School-age'!AA117","v":366},{"$f":"ROUND('Record form School-age'!AB117,0)","v":91},91,{"$f":"'Record form School-age'!AD117","v":6.93},{"$f":"'Record form School-age'!AE117","v":11.55},{"$f":"'Record form School-age'!AF117","v":8},{"$f":"'Record form School-age'!AG117","v":0.26897447254531226},{"$f":"'Record form School-age'!AH117","v":-7.5897890181249039},{"$f":"'Record form School-age'!AI117","v":0.96559485530546618},{"$f":"'Record form School-age'!AJ117","v":2.7822935783756013},{"$f":"'Record form School-age'!AK117","v":5.4532954136161784},{"$f":"'Record form School-age'!AL117","v":2.6865683652289163}]
[{"$f":"'Record form School-age'!U118","v":"Recall of Designs (Gv)"},null,{"$f":"'Record form School-age'!V118","v":80},{"$f":"'Record form School-age'!W118","v":1},{"$f":"'Record form School-age'!X118","v":0},{"$f":"'Record form School-age'!Y118","v":0},{"$f":"'Record form School-age'!Z118","v":0},{"$f":"'Record form School-age'!AA118","v":0},{"$f":"ROUND('Record form School-age'!AB118,0)","v":0},0,{"$f":"'Record form School-age'!AD118","v":2.4300000000000002},{"$f":"'Record form School-age'!AE118","v":1.1200000000000001},{"$f":"'Record form School-age'!AF118","v":3},{"$f":"'Record form School-age'!AG118","v":0.65527804249577848},{"$f":"'Record form School-age'!AH118","v":1.7082936256332317},{"$f":"'Record form School-age'!AI118","v":0.89122137404580148},{"$f":"'Record form School-age'!AJ118","v":4.9472407299114387},{"$f":"'Record form School-age'!AK118","v":9.6965918306264189},{"$f":"'Record form School-age'!AL118","v":4.4090866810470262}]
[{"$f":"'Record form School-age'!U119","v":"Pattern Construction (Gv)"},null,{"$f":"'Record form School-age'!V119","v":39},{"$f":"'Record form School-age'!W119","v":1},{"$f":"'Record form School-age'!X119","v":"vis anal fig and des"},{"$f":"'Record form School-age'!Y119","v":0},{"$f":"'Record form School-age'!Z119","v":146},{"$f":"'Record form School-age'!AA119","v":146},{"$f":"ROUND('Record form School-age'!AB119,0)","v":98},98,{"$f":"'Record form School-age'!AD119","v":2.68},{"$f":"'Record form School-age'!AE119","v":1.6},{"$f":"'Record form School-age'!AF119","v":3},{"$f":"'Record form School-age'!AG119","v":0.60241449667687419},{"$f":"'Record form School-age'!AH119","v":9.6378254984688709},{"$f":"'Record form School-age'!AI119","v":0.94838709677419364},{"$f":"'Record form School-age'!AJ119","v":3.407771005482386},{"$f":"'Record form School-age'!AK119","v":6.6792311707454761},{"$f":"'Record form School-age'!AL119","v":3.2318860503607145}]
[{"$f":"'Record form School-age'!U120","v":0},null,{"$f":"'Record form School-age'!V120","v":0},{"$f":"'Record form School-age'!W120","v":0},{"$f":"'Record form School-age'!X120","v":0},{"$f":"'Record form School-age'!Y120","v":0},{"$f":"'Record form School-age'!Z120","v":0},{"$f":"'Record form School-age'!AA120","v":0},{"$f":"ROUND('Record form School-age'!AB120,0)","v":0},0,{"$f":"'Record form School-age'!AD120","v":1.83},{"$f":"'Record form School-age'!AE120","v":0.55000000000000004},{"$f":"'Record form School-age'!AF120","v":2},{"$f":"'Record form School-age'!AG120","v":0.85194275137059716},{"$f":"'Record form School-age'!AH120","v":14.805724862940281},{"$f":"'Record form School-age'!AI120","v":0.94516129032258067},{"$f":"'Record form School-age'!AJ120","v":3.5126499508802964},{"$f":"'Record form School-age'!AK120","v":6.8847939037253809},{"$f":"'Record form School-age'!AL120","v":3.3200207600255704}]
[{"$f":"'Record form School-age'!U121","v":"Recall of Objects-Immediate (Glr)"},null,{"$f":"'Record form School-age'!V121","v":59},{"$f":"'Record form School-age'!W121","v":1},{"$f":"'Record form School-age'!X121","v":"vis verb int"},{"$f":"'Record form School-age'!Y121","v":0},{"$f":"'Record form School-age'!Z121","v":208},{"$f":"'Record form School-age'!AA121","v":208},{"$f":"ROUND('Record form School-age'!AB121,0)","v":82},82,{"$f":"'Record form School-age'!AD121","v":4.3499999999999996},{"$f":"'Record form School-age'!AE121","v":3.96},{"$f":"'Record form School-age'!AF121","v":5},{"$f":"'Record form School-age'!AG121","v":0.41731116305599292},{"$f":"'Record form School-age'!AH121","v":-4.3277907639982232},{"$f":"'Record form School-age'!AI121","v":0.94969040247678016},{"$f":"'Record form School-age'!AJ121","v":3.364470157799659},{"$f":"'Record form School-age'!AK121","v":6.5943615092873316},{"$f":"'Record form School-age'!AL121","v":3.1952050182818743}]
[{"$f":"'Record form School-age'!U122","v":"Recall of Objects-Delayed (Glr)"},null,{"$f":"'Record form School-age'!V122","v":60},{"$f":"'Record form School-age'!W122","v":1},{"$f":"'Record form School-age'!X122","v":"stme gen"},{"$f":"'Record form School-age'!Y122","v":0},{"$f":"'Record form School-age'!Z122","v":309},{"$f":"'Record form School-age'!AA122","v":309},{"$f":"ROUND('Record form School-age'!AB122,0)","v":103},103,{"$f":"'Record form School-age'!AD122","v":5.21},{"$f":"'Record form School-age'!AE122","v":6.03},{"$f":"'Record form School-age'!AF122","v":6},{"$f":"'Record form School-age'!AG122","v":0.35296560400125876},{"$f":"'Record form School-age'!AH122","v":-5.8896812003776233},{"$f":"'Record form School-age'!AI122","v":0.95625692137320051},{"$f":"'Record form School-age'!AJ122","v":3.1372269109884106},{"$f":"'Record form School-age'!AK122","v":6.1489647455372847},{"$f":"'Record form School-age'!AL122","v":2.9999949475509333}]
[{"$f":"'Record form School-age'!U123","v":"Recall of Digits Forward (Gsm)"},null,{"$f":"'Record form School-age'!V123","v":40},{"$f":"'Record form School-age'!W123","v":1},{"$f":"'Record form School-age'!X123","v":"aud stm"},{"$f":"'Record form School-age'!Y123","v":0},{"$f":"'Record form School-age'!Z123","v":127},{"$f":"'Record form School-age'!AA123","v":127},{"$f":"ROUND('Record form School-age'!AB123,0)","v":86},86,{"$f":"'Record form School-age'!AD123","v":2.76},{"$f":"'Record form School-age'!AE123","v":1.69},{"$f":"'Record form School-age'!AF123","v":3},{"$f":"'Record form School-age'!AG123","v":0.59385568684867185},{"$f":"'Record form School-age'!AH123","v":10.921646972699222},{"$f":"'Record form School-age'!AI123","v":0.96238244514106597},{"$f":"'Record form School-age'!AJ123","v":2.9092868272585561},{"$f":"'Record form School-age'!AK123","v":5.7022021814267703},{"$f":"'Record form School-age'!AL123","v":2.7998465704337834}]
[{"$f":"'Record form School-age'!U124","v":"Recognition of Pictures (Gv)"},null,{"$f":"'Record form School-age'!V124","v":43},{"$f":"'Record form School-age'!W124","v":1},{"$f":"'Record form School-age'!X124","v":"vis stm"},{"$f":"'Record form School-age'!Y124","v":0},{"$f":"'Record form School-age'!Z124","v":102},{"$f":"'Record form School-age'!AA124","v":102},{"$f":"ROUND('Record form School-age'!AB124,0)","v":102},102,{"$f":"'Record form School-age'!AD124","v":1.58},{"$f":"'Record form School-age'!AE124","v":0.37},{"$f":"'Record form School-age'!AF124","v":2},{"$f":"'Record form School-age'!AG124","v":0.90618313999526545},{"$f":"'Record form School-age'!AH124","v":9.3816860004734508},{"$f":"'Record form School-age'!AI124","v":0.84671532846715336},{"$f":"'Record form School-age'!AJ124","v":5.8727379555783426},{"$f":"'Record form School-age'!AK124","v":11.510566392933551},{"$f":"'Record form School-age'!AL124","v":4.9725372470590354}]
[{"$f":"'Record form School-age'!U125","v":"Recall of Sequential Order (Gsm)"},null,{"$f":"'Record form School-age'!V125","v":37},{"$f":"'Record form School-age'!W125","v":1},{"$f":"'Record form School-age'!X125","v":"ver ltr"},{"$f":"'Record form School-age'!Y125","v":0},{"$f":"'Record form School-age'!Z125","v":127},{"$f":"'Record form School-age'!AA125","v":127},{"$f":"ROUND('Record form School-age'!AB125,0)","v":85},85,{"$f":"'Record form School-age'!AD125","v":2.44},{"$f":"'Record form School-age'!AE125","v":1.21},{"$f":"'Record form School-age'!AF125","v":3},{"$f":"'Record form School-age'!AG125","v":0.64430516938133664},{"$f":"'Record form School-age'!AH125","v":3.3542245927995111},{"$f":"'Record form School-age'!AI125","v":0.89667896678966785},{"$f":"'Record form School-age'!AJ125","v":4.8215383927046283},{"$f":"'Record form School-age'!AK125","v":9.4502152497010705},{"$f":"'Record form School-age'!AL125","v":4.3233720643071019}]
[{"$f":"'Record form School-age'!U126","v":"Speed of Information Processing (Gs)"},null,{"$f":"'Record form School-age'!V126","v":""},{"$f":"'Record form School-age'!W126","v":0},{"$f":"'Record form School-age'!X126","v":"k q con"},{"$f":"'Record form School-age'!Y126","v":0},{"$f":"'Record form School-age'!Z126","v":{"$error":"#VALUE!"}},{"$f":"'Record form School-age'!AA126","v":""},{"$f":"ROUND('Record form School-age'!AB126,0)","v":{"$error":"#VALUE!"}},"",{"$f":"'Record form School-age'!AD126","v":1.83},{"$f":"'Record form School-age'!AE126","v":0.3},{"$f":"'Record form School-age'!AF126","v":2},{"$f":"'Record form School-age'!AG126","v":0.93026050941906324},{"$f":"'Record form School-age'!AH126","v":6.9739490580936803},{"$f":"'Record form School-age'!AI126","v":0.93461538461538463},{"$f":"'Record form School-age'!AJ126","v":3.8355623396756906},{"$f":"'Record form School-age'!AK126","v":7.5177021857643531},{"$f":"'Record form School-age'!AL126","v":3.5847755713122802}]
[{"$f":"'Record form School-age'!U127","v":"Recall of Digits Backward (Gsm)"},null,{"$f":"'Record form School-age'!V127","v":50},{"$f":"'Record form School-age'!W127","v":1},{"$f":"'Record form School-age'!X127","v":"hol inf proc"},{"$f":"'Record form School-age'!Y127","v":0},{"$f":"'Record form School-age'!Z127","v":162},{"$f":"'Record form School-age'!AA127","v":162},{"$f":"ROUND('Record form School-age'!AB127,0)","v":108},108,{"$f":"'Record form School-age'!AD127","v":2.57},{"$f":"'Record form School-age'!AE127","v":1.37},{"$f":"'Record form School-age'!AF127","v":3},{"$f":"'Record form School-age'!AG127","v":0.62608790334726172},{"$f":"'Record form School-age'!AH127","v":6.086814497910737},{"$f":"'Record form School-age'!AI127","v":0.92508710801393734},{"$f":"'Record form School-age'!AJ127","v":4.1055329370087996},{"$f":"'Record form School-age'!AK127","v":8.0468445565372466},{"$f":"'Record form School-age'!AL127","v":3.797975591553437}]
[{"$f":"'Record form School-age'!U128","v":"Phonological Processing (Ga)"},null,{"$f":"'Record form School-age'!V128","v":53},{"$f":"'Record form School-age'!W128","v":1},{"$f":"'Record form School-age'!X128","v":"seq info proc"},{"$f":"'Record form School-age'!Y128","v":0},{"$f":"'Record form School-age'!Z128","v":{"$error":"#VALUE!"}},{"$f":"'Record form School-age'!AA128","v":""},{"$f":"ROUND('Record form School-age'!AB128,0)","v":{"$error":"#VALUE!"}},"",{"$f":"'Record form School-age'!AD128","v":5.4},{"$f":"'Record form School-age'!AE128","v":5.69},{"$f":"'Record form School-age'!AF128","v":6},{"$f":"'Record form School-age'!AG128","v":0.35980431966068754},{"$f":"'Record form School-age'!AH128","v":-7.9412958982062634},{"$f":"'Record form School-age'!AI128","v":0.96547756041426924},{"$f":"'Record form School-age'!AJ128","v":2.7870322758786665},{"$f":"'Record form School-age'!AK128","v":5.4625832607221865},{"$f":"'Record form School-age'!AL128","v":2.6908171225111635}]
[{"$f":"'Record form School-age'!U129","v":"Rapid Naming (Gs)"},null,{"$f":"'Record form School-age'!V129","v":44},{"$f":"'Record form School-age'!W129","v":1}]

{"sheet":"DAS-II SA Summary","index":8,"n_rows":80,"n_cols":25,"rows_kept":80,"cut":false,"hidden":false,"merged":[[50,3,50,5],[41,3,41,5],[49,3,49,5],[44,3,44,5],[42,1,42,3],[43,3,43,5],[45,0,45,1],[46,0,46,1],[49,0,49,1],[50,0,50,1],[32,3,32,4],[43,0,43,1],[44,0,44,1],[47,0,47,1],[48,0,48,1],[48,3,48,5],[47,3,47,5],[46,3,46,5],[45,3,45,5],[51,0,51,1],[52,0,52,1],[53,0,53,1],[54,0,54,1],[73,2,74,5],[54,3,54,5],[53,3,53,5],[52,3,52,5],[51,3,51,5],[75,2,76,5],[55,0,55,1],[59,2,60,5],[61,2,62,5],[63,2,64,5],[57,2,57,5],[55,3,55,5],[77,2,78,5],[79,2,80,5],[0,0,1,0],[0,1,1,1],[0,2,1,2],[0,3,1,5],[65,2,66,5],[67,2,68,5],[69,2,70,5],[71,2,72,5]]}
[{"$f":"'Record form School-age'!B2","v":"Name: "},{"$f":"'Record form School-age'!C2","v":"C C"},{"$f":"'Record form School-age'!B3","v":"Age:"},{"$f":"'Record form School-age'!C3","v":"8 years, 6 months, 14 days"}]
[]
[null,"Composite/Cluster","Score",{"$f":"CHOOSE(btwcl,\"85% confidence\",\"90% confidence\", \"95% confidence\")","v":"90% confidence"},"PR","Classification"]
[null,"General Conceptual Ability (GCA):",{"$f":"'Record form School-age'!L17","v":80},{"$f":"'Record form School-age'!L19","v":"75 to 87"},{"$f":"IF(C4=\"\",\"\",'Record form School-age'!L18&\" PR\")","v":"9 PR"},{"$f":"IF(C4=\"\",\"\",LOOKUP(C4,ssname))","v":"Below average"}]
[null,"Special Nonverbal Composite (SNC):",{"$f":"'Record form School-age'!N17","v":58},{"$f":"'Record form School-age'!N19","v":"54 to 65"},{"$f":"IF(C5=\"\",\"\",'Record form School-age'!N18&\" PR\")","v":"1 PR"},"Very Low"]
[null,"Verbal (V):",{"$f":"'Record form School-age'!F17","v":100},{"$f":"'Record form School-age'!F19","v":"91 to 109"},{"$f":"IF(C6=\"\",\"\",'Record form School-age'!F18&\" PR\")","v":"50 PR"},"Average"]
[null,"Nonverbal Reasoning (NVR):",{"$f":"'Record form School-age'!H17","v":74},{"$f":"'Record form School-age'!H19","v":"68 to 84"},{"$f":"IF(C7=\"\",\"\",'Record form School-age'!H18&\" PR\")","v":"4 PR"},"Low"]
[null,"Spatial (Sp):",{"$f":"'Record form School-age'!J17","v":91},{"$f":"'Record form School-age'!J19","v":"85 to 98"},{"$f":"IF(C8=\"\",\"\",'Record form School-age'!J18&\" PR\")","v":"27 PR"},"Average"]
[null,"Working Memory (WM):",{"$f":"'Record form School-age'!F42","v":89},{"$f":"'Record form School-age'!F44","v":"83 to 96"},{"$f":"IF(C9=\"\",\"\",'Record form School-age'!F43&\" PR\")","v":"23 PR"},"Below average"]
[null,"Processing Speed (PS):",{"$f":"'Record form School-age'!H42","v":""},{"$f":"'Record form School-age'!H44","v":""},{"$f":"IF(C10=\"\",\"\",'Record form School-age'!H43&\" PR\")","v":""},""]
[null,"School Readiness (SchR):",{"$f":"'Record form School-age'!J42","v":""},{"$f":"'Record form School-age'!J44","v":""},{"$f":"IF(C11=\"\",\"\",'Record form School-age'!J43&\" PR\")","v":""},""]
[null,"Between Clusters","Difference","Significant","Base rate"]
[null,{"$f":"\"     V ( \"&C6&\" ) vs. NVR ( \"&C7&\" ):   \"","v":"     V ( 100 ) vs. NVR ( 74 ):   "},{"$f":"'Record form School-age'!H52","v":26},{"$f":"'Record form School-age'!F20","v":"V > NVR"},{"$f":"IF(C13=\"\",\"\",'Record form School-age'!L52)","v":"5%"}]
[null,{"$f":"\"     V ( \"&C6&\" ) vs. Sp ( \"&C8&\" ):   \"","v":"     V ( 100 ) vs. Sp ( 91 ):   "},{"$f":"'Record form School-age'!H54","v":9},{"$f":"'Record form School-age'!J20","v":"No"},{"$f":"IF(C14=\"\",\"\",'Record form School-age'!L54)","v":">15%"}]
[null,{"$f":"\"     NVR ( \"&C7&\" ) vs. Sp ( \"&C8&\" ):   \"","v":"     NVR ( 74 ) vs. Sp ( 91 ):   "},{"$f":"'Record form School-age'!H53","v":-17},{"$f":"'Record form School-age'!H20","v":"NVR < Sp"},{"$f":"IF(C15=\"\",\"\",'Record form School-age'!L53)","v":"10%"}]
[null,{"$f":"\"     GCA ( \"&C4&\" ) vs. WM ( \"&C9&\" ):   \"","v":"     GCA ( 80 ) vs. WM ( 89 ):   "},{"$f":"IF(OR(C4=\"\",C9=\"\"),\"\",C4-C9)","v":-9},{"$f":"'Record form School-age'!F45","v":"WM > GCA"},{"$f":"IF(C16=\"\",\"\",'Record form School-age'!AC42)","v":">15"}]
[null,{"$f":"\"     GCA ( \"&C4&\" ) vs. PS ( \"&C10&\" ):   \"","v":"     GCA ( 80 ) vs. PS (  ):   "},{"$f":"IF(OR(C4=\"\",C10=\"\"),\"\",C4-C10)","v":""},{"$f":"'Record form School-age'!H45","v":""},{"$f":"IF(C17=\"\",\"\",'Record form School-age'!AC43)","v":""}]
["Cluster","Within Clusters","Difference","Significant","Base rate"]
["Verbal",{"$f":"\"WD ( \"&'Record form School-age'!F9&\" ) vs VSim ( \"&'Record form School-age'!F12&\" )\"","v":"WD ( 43 ) vs VSim ( 40 )"},{"$f":"'Record form School-age'!H57","v":3},{"$f":"'Record form School-age'!F21","v":"No"},{"$f":"'Record form School-age'!L57","v":">15%"},{"$f":"'Record form School-age'!F56","v":""}]
["Nonverbal Reasoning",{"$f":"\"Mat ( \"&'Record form School-age'!H11&\" ) vs SQR ( \"&'Record form School-age'!H13&\" )\"","v":"Mat ( 27 ) vs SQR ( 41 )"},{"$f":"'Record form School-age'!H59","v":-14},{"$f":"'Record form School-age'!H21","v":"Mat < SQR"},{"$f":"'Record form School-age'!L59","v":"5%"},{"$f":"'Record form School-age'!F58","v":"Interpret With Caution"}]
["Spatial",{"$f":"\"RDes ( \"&'Record form School-age'!J8&\" ) vs PCon ( \"&'Record form School-age'!J10&\" )\"","v":"RDes ( 80 ) vs PCon ( 39 )"},{"$f":"'Record form School-age'!H61","v":41},{"$f":"'Record form School-age'!J21","v":"RDes > PC"},{"$f":"'Record form School-age'!L61","v":"<5%"},{"$f":"'Record form School-age'!F60","v":"Interpret With Caution"}]
["Working Memory",{"$f":"\"RSO ( \"&'Record form School-age'!F34&\" ) vs RDb ( \"&'Record form School-age'!F36&\" )\"","v":"RSO ( 37 ) vs RDb ( 50 )"},{"$f":"'Record form School-age'!H63","v":-13},{"$f":"'Record form School-age'!J63","v":"Yes"},{"$f":"'Record form School-age'!L63","v":"10%"},{"$f":"'Record form School-age'!F62","v":"Interpret With Caution"}]
["Processing Speed",{"$f":"\"SIP ( \"&'Record form School-age'!H35&\" ) vs RN ( \"&'Record form School-age'!H38&\" )\"","v":"SIP (  ) vs RN ( 44 )"},{"$f":"'Record form School-age'!H65","v":""},{"$f":"'Record form School-age'!J65","v":""},{"$f":"'Record form School-age'!L65","v":""},{"$f":"'Record form School-age'!F64","v":""}]
[null,{"$f":"\"Mean Core T = \"&'Record form School-age'!F68&\"  using  \"&'Record form School-age'!V72","v":"Mean Core T = 45  using  GCA"},"T score","High/Low","Frequency"]
[null,"Word Definition (Gc)",{"$f":"'Record form School-age'!F70","v":43},{"$f":"'Record form School-age'!L70","v":""},{"$f":"'Record form School-age'!N70","v":""}]
[null,"Verbal Similarities (Gc)",{"$f":"'Record form School-age'!F71","v":40},{"$f":"'Record form School-age'!L71","v":""},{"$f":"'Record form School-age'!N71","v":""}]
[null,"Matrices (Gf)",{"$f":"'Record form School-age'!F72","v":27},{"$f":"'Record form School-age'!L72","v":"Low"},{"$f":"'Record form School-age'!N72","v":"<10%"}]
[null,"Sequential & Quantitative Reasoning (Gf)",{"$f":"'Record form School-age'!F73","v":41},{"$f":"'Record form School-age'!L73","v":""},{"$f":"'Record form School-age'!N73","v":""}]
[null,"Recall of Designs (Gv)",{"$f":"'Record form School-age'!F74","v":80},{"$f":"'Record form School-age'!L74","v":"High"},{"$f":"'Record form School-age'!N74","v":"<10%"}]
[null,"Pattern Construction (Gv)",{"$f":"'Record form School-age'!F75","v":39},{"$f":"'Record form School-age'!L75","v":"Low"},{"$f":"'Record form School-age'!N75","v":"15%"}]
[]
[null,"Recall of Objects-Immediate (Glr)",{"$f":"'Record form School-age'!F77","v":59},{"$f":"'Record form School-age'!L77","v":"High"},{"$f":"'Record form School-age'!N77","v":"<10%"}]
[null,"Recall of Objects-Delayed (Glr)",{"$f":"'Record form School-age'!F78","v":60},{"$f":"'Record form School-age'!L78","v":""}]
[null,"Recall of Digits Forward (Gsm)",{"$f":"'Record form School-age'!F79","v":40},{"$f":"'Record form School-age'!L79","v":""},{"$f":"'Record form School-age'!N79","v":""}]
[null,"Recognition of Pictures (Gv)",{"$f":"'Record form School-age'!F80","v":43},{"$f":"'Record form School-age'!L80","v":""},{"$f":"'Record form School-age'!N80","v":""}]
[null,"Recall of Sequential Order (Gsm)",{"$f":"'Record form School-age'!F81","v":37},{"$f":"'Record form School-age'!L81","v":"Low"},{"$f":"'Record form School-age'!N81","v":"15%"}]
[null,"Speed of Information Processing (Gs)",{"$f":"'Record form School-age'!F82","v":""},{"$f":"'Record form School-age'!L82","v":""},{"$f":"'Record form School-age'!N82","v":""}]
[null,"Recall of Digits Backward (Gsm)",{"$f":"'Record form School-age'!F83","v":50},{"$f":"'Record form School-age'!L83","v":""},{"$f":"'Record form School-age'!N83","v":""}]
[null,"Phonological Processing (Ga)",{"$f":"'Record form School-age'!F84","v":53},{"$f":"'Record form School-age'!L84","v":""},{"$f":"'Record form School-age'!N84","v":""}]
[null,"Rapid Naming (Gs)",{"$f":"'Record form School-age'!F85","v":44},{"$f":"'Record form School-age'!L85","v":""},{"$f":"'Record form School-age'!N85","v":""}]
[]
[null,"School-Age Shared Ability","SS","Subtests"]
[]
["Formulation and Testing of Hypotheses ",null,{"$f":"'Shared Abilities SA'!J73","v":76},"VS, SQR, PC, Mat"]
["Use of Verbal Mediation to Solve Nonverbal Problems",null,{"$f":"'Shared Abilities SA'!J74","v":75},"SQR, PCon, Mat"]
["Verbal Comprehension:",null,{"$f":"'Shared Abilities SA'!J75","v":83},"WD, RSO"]
["Verbal Expression:",null,{"$f":"'Shared Abilities SA'!J76","v":91},"VS, WD, ROi, RDf, RSO, RDb, PhP, RN"]
["Visual Analysis of Figures or Designs:",null,{"$f":"'Shared Abilities SA'!J78","v":98},"PC, Mat, RDes"]
["Visual Verbal Integration:",null,{"$f":"'Shared Abilities SA'!J80","v":82},"SQR, Mat, ROi, RSO"]
["Short-term Memory: (general):",null,{"$f":"'Shared Abilities SA'!J81","v":103},"RDes, ROi, RDf, RPic, RSO, RDb"]
["Auditory Short-term Memory:",null,{"$f":"'Shared Abilities SA'!J82","v":86},"RDf, RSO, RDb"]
["Visual Short-term Memory:",null,{"$f":"'Shared Abilities SA'!J83","v":102},"ROi, RPic"]
["Verbal Long -term Information Retrieval:",null,{"$f":"'Shared Abilities SA'!J84","v":85},"VS, WD, RN"]
["Knowledge of Quantitative Concepts:",null,{"$f":"'Shared Abilities SA'!J85","v":""},"SQR, SIP"]
["Visual/holistic Information Processing:",null,{"$f":"'Shared Abilities SA'!J86","v":108},"PC, RDes, RPic"]
["Sequential Information Processing:",null,{"$f":"'Shared Abilities SA'!J87","v":""},"ROi, RDf, RSO, SIP, RDb, RN"]
[]
["Comparison","Significance","Possible implication"]
[]
[{"$f":"\"RDf  (\"&C34&\") vs. RDb (\"&C38&\")\"","v":"RDf  (40) vs. RDb (50)"},{"$f":"W60","v":"RDf  < RDb "},"Non-meaningful auditory memory span versus Non-meaningful auditory working memory",null,null,null,null,null,null,null,null,null,null,{"$f":"B25","v":"Word Definition (Gc)"},43,null,{"$f":"O69","v":40},{"$f":"O73","v":50},{"$f":"IF(OR(Q60=\"\",R60=\"\"),\"\",Q60-R60)","v":-10},8,{"$f":"IF(OR(Q60=\"\",R60=\"\"),\"\",IF(Q60=R60,1,IF(S60<0,2,3)))","v":2},{"$f":"IF(ABS(S60)>=T60,1,0)","v":1},{"$f":"IF(OR(Q60=\"\",R60=\"\"),\"\",IF(V60=1,CHOOSE(U60,\"NS\",Y60,X60),\"NS\"))","v":"RDf  < RDb "},"RDf > RDb ","RDf  < RDb "]
[null,null,null,null,null,null,null,null,null,null,null,null,null,"Verbal Similarities (Gc)",40,null,{"$f":"O69","v":40},{"$f":"O71","v":37},3,8,3,0,{"$f":"IF(OR(Q61=\"\",R61=\"\"),\"\",IF(V61=1,CHOOSE(U61,\"NS\",Y61,X61),\"NS\"))","v":"NS"},"RDf > RSO","RDf < RSO"]
[{"$f":"\"RDf  (\"&C34&\") vs. RSO (\"&C36&\")\"","v":"RDf  (40) vs. RSO (37)"},{"$f":"W61","v":"NS"},"Non-meaningful auditory memory span versus Meaningful auditory/visual working memory",null,null,null,null,null,null,null,null,null,null,"Matrices (Gf)",27,null,{"$f":"O69","v":40},{"$f":"O70","v":43},-3,12,{"$f":"IF(OR(Q62=\"\",R62=\"\"),\"\",IF(Q62=R62,1,IF(S62<0,2,3)))","v":2},0,"NS","RDf > RPic ","RDf < RPic "]
[null,null,null,null,null,null,null,null,null,null,null,null,null,"Sequential & Quantitative Reasoning (Gf)",41,null,{"$f":"O69","v":40},{"$f":"O64","v":80},-40,9,{"$f":"IF(OR(Q63=\"\",R63=\"\"),\"\",IF(Q63=R63,1,IF(S63<0,2,3)))","v":2},1,"RDf < RDes ","RDf > RDes ","RDf < RDes "]
[{"$f":"\"RDf  (\"&C34&\") vs. RPic (\"&C35&\")\"","v":"RDf  (40) vs. RPic (43)"},{"$f":"W62","v":"NS"},"Non-meaningful auditory memory span versus Visual memory ",null,null,null,null,null,null,null,null,null,null,"Recall of Designs (Gv)",80,null,{"$f":"O73","v":50},{"$f":"O71","v":37},13,8,3,1,"RDb > RSO","RDb > RSO","RDb < RSO"]
[null,null,null,null,null,null,null,null,null,null,null,null,null,"Pattern Construction (Gv)",39,null,{"$f":"O67","v":59},{"$f":"O68","v":60},-1,11,2,0,"NS","ROi > ROd","RObi < ROd"]
[{"$f":"\"RDf  (\"&C34&\") vs. RDes (\"&C29&\")\"","v":"RDf  (40) vs. RDes (80)"},{"$f":"W63","v":"RDf < RDes "},"Non-meaningful auditory memory span versus Non-meaningful visual memory",null,null,null,null,null,null,null,null,null,null,null,null,null,{"$f":"O67","v":59},{"$f":"O69","v":40},19,10,3,1,"ROi > RDf","ROi > RDf","RObi < RDf"]
[null,null,null,null,null,null,null,null,null,null,null,null,null,{"$f":"B32","v":"Recall of Objects-Immediate (Glr)"},{"$f":"C32","v":59},null,{"$f":"O67","v":59},{"$f":"O73","v":50},9,14,3,0,"NS","ROi > RDb","ROi < RDb"]
[{"$f":"\"RDb  (\"&C38&\") vs. RSO (\"&C36&\")\"","v":"RDb  (50) vs. RSO (37)"},{"$f":"W64","v":"RDb > RSO"},"Non-meaningful auditory working memory versus Meaningful auditory/visual working memory",null,null,null,null,null,null,null,null,null,null,"Recall of Objects-Delayed (Glr)",60,null,{"$f":"O64","v":80},{"$f":"O70","v":43},37,12,3,{"$f":"IF(ABS(S68)>=T68,1,0)","v":1},{"$f":"IF(OR(Q68=\"\",R68=\"\"),\"\",IF(V68=1,CHOOSE(U68,\"NS\",Y68,X68),\"NS\"))","v":"RDes > RPic"},"RDes > RPic","RDes < RPic"]
[null,null,null,null,null,null,null,null,null,null,null,null,null,"Recall of Digits Forward (Gsm)",40,null,{"$f":"O75","v":44},{"$f":"O75","v":44},0,10,1,{"$f":"IF(ABS(S69)>=T69,1,0)","v":0},"NS","SIP > RN","SIP < RN"]
[{"$f":"\"ROi  (\"&C32&\") vs. ROd (\"&C33&\")\"","v":"ROi  (59) vs. ROd (60)"},{"$f":"W65","v":"NS"},"Meaningful visual memory immediate versus Meaningful visual memory delayed",null,null,null,null,null,null,null,null,null,null,"Recognition of Pictures (Gv)",43,null,{"$f":"O67","v":59},{"$f":"O75","v":44},15,12,3,{"$f":"IF(ABS(S70)>=T70,1,0)","v":1},"ROi > RN","ROi > RN","ROi < RN"]
[null,null,null,null,null,null,null,null,null,null,null,null,null,"Recall of Sequential Order (Gsm)",37]
[{"$f":"\"ROi  (\"&C32&\") vs. RDf (\"&C34&\")\"","v":"ROi  (59) vs. RDf (40)"},{"$f":"W66","v":"ROi > RDf"},"Meaningful visual memory immediate versus Non-meaningful auditory memory  span ",null,null,null,null,null,null,null,null,null,null,"Speed of Information Processing (Gs)",""]
[null,null,null,null,null,null,null,null,null,null,null,null,null,"Recall of Digits Backward (Gsm)",50]
[{"$f":"\"ROi  (\"&C32&\") vs. RDb (\"&C38&\")\"","v":"ROi  (59) vs. RDb (50)"},{"$f":"W67","v":"NS"},"Meaningful visual memory versus Non-meaningful auditory working memory",null,null,null,null,null,null,null,null,null,null,"Phonological Processing (Ga)",53]
[null,null,null,null,null,null,null,null,null,null,null,null,null,"Rapid Naming (Gs)",44]
[{"$f":"\"RDes  (\"&C29&\") vs. RPic (\"&C35&\")\"","v":"RDes  (80) vs. RPic (43)"},{"$f":"W68","v":"RDes > RPic"},"Non-meaningful visual memory versus Meaningful visual memory"]
[]
[{"$f":"\"SIP (\"&C37&\") vs. RN (\"&C40&\")\"","v":"SIP () vs. RN (44)"},{"$f":"W69","v":"NS"},"Processing Speed Cluster: If significant difference is evidenced, examine ROi vs. RN comparison"]
[]
[{"$f":"\"ROi (\"&C32&\") vs. RN (\"&C40&\")\"","v":"ROi (59) vs. RN (44)"},{"$f":"W70","v":"ROi > RN"},"* Make this comparison only if the SIP vs. RN is significant. RN could involve Glr"]

{"sheet":"DAS-II Culture Linguistic","index":9,"n_rows":45,"n_cols":19,"rows_kept":45,"cut":false,"hidden":false,"merged":[[3,0,26,0],[29,1,55,1],[58,1,103,1],[19,2,20,2],[11,2,12,2],[3,3,3,4],[12,3,12,4],[20,3,20,4],[105,1,140,1],[5,1,10,1],[13,1,18,1],[21,1,26,1],[28,2,28,11],[19,5,20,5],[5,3,5,4],[6,3,6,4],[11,8,12,8],[7,3,7,4],[4,6,4,7],[11,3,11,4],[11,6,11,7],[8,3,8,4],[10,3,10,4],[6,6,6,7],[11,5,12,5],[9,3,9,4],[20,6,20,7],[20,9,20,10],[19,8,20,8],[19,3,19,4],[3,2,4,2],[5,6,5,7],[3,5,4,5],[3,8,4,8],[4,3,4,4],[11,9,11,10],[21,6,21,7],[21,9,21,10],[3,9,3,10],[19,9,19,10],[19,6,19,7],[13,6,13,7],[14,6,14,7],[12,9,12,10],[4,9,4,10],[5,9,5,10],[21,15,26,15],[5,11,10,11],[13,11,18,11],[21,11,26,11],[13,3,13,4],[14,3,14,4],[15,3,15,4],[16,3,16,4],[22,9,22,10],[22,6,22,7],[1,2,1,10],[0,3,0,5],[0,6,0,7],[0,8,0,9],[5,15,10,15],[13,15,18,15],[15,6,15,7],[13,9,13,10],[12,6,12,7],[3,6,3,7]]}
[null,null,"Name",{"$f":"'Record form School-age'!C2","v":"C C"},null,null,"Age",null,{"$f":"'Record form School-age'!C3","v":"8 years, 6 months, 14 days"}]
[null,null,"DEGREE OF LINGUISTIC DEMAND"]
[null,null,"LOW",null,null,"MEDIUM ",null,null,"HIGH"]
["DEGREE OF CULTURAL LOADING",null,{"$f":"\"Low/Low Cell Average = \"&IF(COUNT(D6:D11)=0,\"\",ROUND(AVERAGE(D6:D11),0))","v":"Low/Low Cell Average = 95"},"SS",null,{"$f":"\"Low/Medium Cell Average = \"&IF(COUNT(G6:G11)=0,\"\",ROUND(AVERAGE(G6:G11),0))","v":"Low/Medium Cell Average = 100"},"SS",null,{"$f":"\"Low/High Cell Average = \"&IF(COUNT(J6:J11)=0,\"\",ROUND(AVERAGE(J6:J11),0))","v":"Low/High Cell Average = 85"},"SS"]
[null,null,null,"Score",null,null,"Score",null,null,"Score"]
[null,"LOW",{"$f":"\"Matrices T = \"&IF('Input page School-age'!D11=\"\",\"\",'Input page School-age'!D11)&\"     \"","v":"Matrices T = 27     "},{"$f":"IF('Input page School-age'!D11=\"\",\"\",(15*('Input page School-age'!D11-50)/10)+100)","v":65.5},null,{"$f":"\"Recall of Digits Backward T = \"&IF('Input page School-age'!D28=\"\",\"\",'Input page School-age'!D28)&\"     \"","v":"Recall of Digits Backward T = 50     "},{"$f":"IF('Input page School-age'!D28=\"\",\"\",(15*('Input page School-age'!D28-50)/10)+100)","v":100},null,{"$f":"\"Recall of Digits Forward T = \"&IF('Input page School-age'!D24=\"\",\"\",'Input page School-age'!D24)&\"     \"","v":"Recall of Digits Forward T = 40     "},{"$f":"IF('Input page School-age'!D24=\"\",\"\",(15*('Input page School-age'!D24-50)/10)+100)","v":85},null,{"$f":"\"Low Cultural Loading = \"&S11","v":"Low Cultural Loading = 93"},null,null,null,{"$f":"IF(COUNT(D6:D11)=0,\"\",ROUND(AVERAGE(D6:D11),0))","v":95}]
[null,null,{"$f":"\"Sequential & Quantitative Reasoning T = \"&IF('Input page School-age'!D13=\"\",\"\",'Input page School-age'!D13)&\"     \"","v":"Sequential & Quantitative Reasoning T = 41     "},{"$f":"IF('Input page School-age'!D13=\"\",\"\",(15*('Input page School-age'!D13-50)/10)+100)","v":86.5},null,{"$f":"\"Speed of Information Processing T = \"&IF('Input page School-age'!D27=\"\",\"\",'Input page School-age'!D27)&\"     \"","v":"Speed of Information Processing T =      "},{"$f":"IF('Input page School-age'!D27=\"\",\"\",(15*('Input page School-age'!D27-50)/10)+100)","v":""},null,null,null,{"$f":"IF(J7=\"\",\"\",IF(AND(J7>0,J7<20),(15*((J7-10)/3)+100),J7))","v":""}]
[null,null,{"$f":"\"Pattern Construction T = \"&IF('Input page School-age'!D10=\"\",\"\",'Input page School-age'!D10)&\"     \"","v":"Pattern Construction T = 39     "},{"$f":"IF('Input page School-age'!D10=\"\",\"\",(15*('Input page School-age'!D10-50)/10)+100)","v":83.5},null,null,null,{"$f":"IF(G8=\"\",\"\",IF(AND(G8>0,G8<20),(15*((G8-10)/3)+100),G8))","v":""},null,null,{"$f":"IF(J8=\"\",\"\",IF(AND(J8>0,J8<20),(15*((J8-10)/3)+100),J8))","v":""}]
[null,null,{"$f":"\"Recall of Designs T = \"&IF('Input page School-age'!D8=\"\",\"\",'Input page School-age'!D8)&\"     \"","v":"Recall of Designs T = 80     "},{"$f":"IF('Input page School-age'!D8=\"\",\"\",(15*('Input page School-age'!D8-50)/10)+100)","v":145},null,null,null,null,null,null,{"$f":"IF(J9=\"\",\"\",IF(AND(J9>0,J9<20),(15*((J9-10)/3)+100),J9))","v":""}]
[null,null,{"$f":"\"Matching Letter-like Forms T = \"&IF('Input page School-age'!D53=\"\",\"\",'Input page School-age'!D53)&\"     \"","v":"Matching Letter-like Forms T =      "},{"$f":"IF('Input page School-age'!D53=\"\",\"\",(15*('Input page School-age'!D53-50)/10)+100)","v":""},null,null,null,{"$f":"IF(G10=\"\",\"\",IF(AND(G10>0,G10<20),(15*((G10-10)/3)+100),G10))","v":""},null,null,{"$f":"IF(J10=\"\",\"\",IF(AND(J10>0,J10<20),(15*((J10-10)/3)+100),J10))","v":""}]
[null,null,{"$f":"\"Copying T = \"&IF('Input page School-age'!D57=\"\",\"\",'Input page School-age'!D57)&\"     \"","v":"Copying T =      "},{"$f":"IF('Input page School-age'!D57=\"\",\"\",(15*('Input page School-age'!D57-50)/10)+100)","v":""},null,null,null,{"$f":"IF(G11=\"\",\"\",IF(AND(G11>0,G11<20),(15*((G11-10)/3)+100),G11))","v":""},null,null,{"$f":"IF(J11=\"\",\"\",IF(AND(J11>0,J11<20),(15*((J11-10)/3)+100),J11))","v":""},null,null,null,null,null,{"$f":"IF(COUNT(G6:G11)=0,\"\",ROUND(AVERAGE(G6:G11),0))","v":100},{"$f":"IF(COUNT(J6:J11)=0,\"\",ROUND(AVERAGE(J6:J11),0))","v":85},{"$f":"IF(COUNT(P6:R11)=0,\"\",ROUND(AVERAGE(P6:R11),0))","v":93}]
[null,null,{"$f":"\"Medium/Low Cell Average = \"&IF(COUNT(D14:D19)=0,\"\",ROUND(AVERAGE(D14:D19),0))","v":"Medium/Low Cell Average = 106"},"SS",null,{"$f":"\"Medium/Medium Cell Average = \"&IF(COUNT(G14:G19)=0,\"\",ROUND(AVERAGE(G14:G19),0))","v":"Medium/Medium Cell Average = 86"},"SS",null,{"$f":"\"Medium/High Cell Average = \"&IF(COUNT(J14:J19)=0,\"\",ROUND(AVERAGE(J14:J19),0))","v":"Medium/High Cell Average = 105"},"SS"]
[null,null,null,"Score",null,null,"Score",null,null,"Score"]
[null,"MEDIUM",{"$f":"\"Picture Similarities T = \"&IF('Input page School-age'!D55=\"\",\"\",'Input page School-age'!D55)&\"     \"","v":"Picture Similarities T =      "},{"$f":"IF('Input page School-age'!D55=\"\",\"\",(15*('Input page School-age'!D55-50)/10)+100)","v":""},null,{"$f":"\"Early Number Concepts T = \"&IF('Input page School-age'!D52=\"\",\"\",'Input page School-age'!D52)&\"     \"","v":"Early Number Concepts T =      "},{"$f":"IF('Input page School-age'!D52=\"\",\"\",(15*('Input page School-age'!D52-50)/10)+100)","v":""},null,{"$f":"\"Phonological Processing T = \"&IF('Input page School-age'!D29=\"\",\"\",'Input page School-age'!D29)&\"     \"","v":"Phonological Processing T = 53     "},{"$f":"IF('Input page School-age'!D29=\"\",\"\",(15*('Input page School-age'!D29-50)/10)+100)","v":104.5},null,{"$f":"\"Medium Cultural Loading = \"&S19","v":"Medium Cultural Loading = 99"},null,null,null,{"$f":"IF(COUNT(D14:D19)=0,\"\",ROUND(AVERAGE(D14:D19),0))","v":106}]
[null,null,{"$f":"\"Recognition of Pictures T = \"&IF('Input page School-age'!D25=\"\",\"\",'Input page School-age'!D25)&\"     \"","v":"Recognition of Pictures T = 43     "},{"$f":"IF('Input page School-age'!D25=\"\",\"\",(15*('Input page School-age'!D25-50)/10)+100)","v":89.5},null,{"$f":"\"Rapid Naming T = \"&IF('Input page School-age'!D30=\"\",\"\",'Input page School-age'!D30)&\"     \"","v":"Rapid Naming T = 44     "},{"$f":"IF('Input page School-age'!D30=\"\",\"\",(15*('Input page School-age'!D30-50)/10)+100)","v":91},null,null,null,{"$f":"IF(J15=\"\",\"\",IF(AND(J15>0,J15<20),(15*((J15-10)/3)+100),J15))","v":""}]
[null,null,{"$f":"\"Recall of Objects-Immediate T = \"&IF('Input page School-age'!D22=\"\",\"\",'Input page School-age'!D22)&\"     \"","v":"Recall of Objects-Immediate T = 59     "},{"$f":"IF('Input page School-age'!D22=\"\",\"\",(15*('Input page School-age'!D22-50)/10)+100)","v":113.5},null,{"$f":"\"Recall of Sequential Order T = \"&IF('Input page School-age'!D26=\"\",\"\",'Input page School-age'!D26)&\"     \"","v":"Recall of Sequential Order T = 37     "},{"$f":"IF('Input page School-age'!D26=\"\",\"\",(15*('Input page School-age'!D26-50)/10)+100)","v":80.5},null,null,null,{"$f":"IF(J16=\"\",\"\",IF(AND(J16>0,J16<20),(15*((J16-10)/3)+100),J16))","v":""}]
[null,null,{"$f":"\"Recall of Objects-Delayed T = \"&IF('Input page School-age'!D23=\"\",\"\",'Input page School-age'!D23)&\"     \"","v":"Recall of Objects-Delayed T = 60     "},{"$f":"IF('Input page School-age'!D23=\"\",\"\",(15*('Input page School-age'!D23-50)/10)+100)","v":115},null,null,null,{"$f":"IF(G17=\"\",\"\",IF(AND(G17>0,G17<20),(15*((G17-10)/3)+100),G17))","v":""},null,null,{"$f":"IF(J17=\"\",\"\",IF(AND(J17>0,J17<20),(15*((J17-10)/3)+100),J17))","v":""}]
[null,null,null,null,{"$f":"IF(D18=\"\",\"\",IF(AND(D18>0,D18<20),(15*((D18-10)/3)+100),D18))","v":""},null,null,{"$f":"IF(G18=\"\",\"\",IF(AND(G18>0,G18<20),(15*((G18-10)/3)+100),G18))","v":""},null,null,{"$f":"IF(J18=\"\",\"\",IF(AND(J18>0,J18<20),(15*((J18-10)/3)+100),J18))","v":""}]
[null,null,null,null,{"$f":"IF(D19=\"\",\"\",IF(AND(D19>0,D19<20),(15*((D19-10)/3)+100),D19))","v":""},null,null,{"$f":"IF(G19=\"\",\"\",IF(AND(G19>0,G19<20),(15*((G19-10)/3)+100),G19))","v":""},null,null,{"$f":"IF(J19=\"\",\"\",IF(AND(J19>0,J19<20),(15*((J19-10)/3)+100),J19))","v":""},null,null,null,null,null,{"$f":"IF(COUNT(G14:G19)=0,\"\",ROUND(AVERAGE(G14:G19),0))","v":86},{"$f":"IF(COUNT(J14:J19)=0,\"\",ROUND(AVERAGE(J14:J19),0))","v":105},{"$f":"IF(COUNT(P14:R19)=0,\"\",ROUND(AVERAGE(P14:R19),0))","v":99}]
[null,null,{"$f":"\"High/Low Cell Average = \"&IF(COUNT(D22:D27)=0,\"\",ROUND(AVERAGE(E22:E27),0))","v":"High/Low Cell Average = "},"SS",null,{"$f":"\"High/Medium Cell Average = \"&IF(COUNT(G22:G27)=0,\"\",ROUND(AVERAGE(G22:G27),0))","v":"High/Medium Cell Average = "},"SS",null,{"$f":"\"High/High Cell Average = \"&IF(COUNT(J22:J27)=0,\"\",ROUND(AVERAGE(J22:J27),0))","v":"High/High Cell Average = 87"},"SS"]
[null,null,null,"Score",null,null,"Score",null,null,"Score"]
[null,"HIGH",null,null,{"$f":"IF(D22=\"\",\"\",IF(AND(D22>0,D22<20),(15*((D22-10)/3)+100),D22))","v":""},{"$f":"\"Verbal Comprehension T = \"&IF('Input page School-age'!D54=\"\",\"\",'Input page School-age'!D54)&\"     \"","v":"Verbal Comprehension T =      "},{"$f":"IF('Input page School-age'!D54=\"\",\"\",(15*('Input page School-age'!D54-50)/10)+100)","v":""},null,{"$f":"\"Verbal Similarities T = \"&IF('Input page School-age'!D12=\"\",\"\",'Input page School-age'!D12)&\"     \"","v":"Verbal Similarities T = 40     "},{"$f":"IF('Input page School-age'!D12=\"\",\"\",(15*('Input page School-age'!D12-50)/10)+100)","v":85},null,{"$f":"\"High Cultural Loading = \"&S27","v":"High Cultural Loading = 87"},null,null,null,{"$f":"IF(COUNT(D22:D27)=0,\"\",ROUND(AVERAGE(D22:D27),0))","v":""}]
[null,null,null,null,"",{"$f":"\"Naming Vocabulary T = \"&IF('Input page School-age'!D56=\"\",\"\",'Input page School-age'!D56)&\"     \"","v":"Naming Vocabulary T =      "},{"$f":"IF('Input page School-age'!D56=\"\",\"\",(15*('Input page School-age'!D56-50)/10)+100)","v":""},null,{"$f":"\"Word Definitions T = \"&IF('Input page School-age'!D9=\"\",\"\",'Input page School-age'!D9)&\"     \"","v":"Word Definitions T = 43     "},{"$f":"IF('Input page School-age'!D9=\"\",\"\",(15*('Input page School-age'!D9-50)/10)+100)","v":89.5}]
[null,null,null,null,"",null,null,{"$f":"IF(G24=\"\",\"\",IF(AND(G24>0,G24<20),(15*((G24-10)/3)+100),G24))","v":""},null,null,{"$f":"IF(J24=\"\",\"\",IF(AND(J24>0,J24<20),(15*((J24-10)/3)+100),J24))","v":""}]
[null,null,null,null,"",null,null,{"$f":"IF(G25=\"\",\"\",IF(AND(G25>0,G25<20),(15*((G25-10)/3)+100),G25))","v":""},null,null,{"$f":"IF(J25=\"\",\"\",IF(AND(J25>0,J25<20),(15*((J25-10)/3)+100),J25))","v":""}]
[null,null,null,null,"",null,null,{"$f":"IF(G26=\"\",\"\",IF(AND(G26>0,G26<20),(15*((G26-10)/3)+100),G26))","v":""},null,null,{"$f":"IF(J26=\"\",\"\",IF(AND(J26>0,J26<20),(15*((J26-10)/3)+100),J26))","v":""}]
[null,null,null,null,"",null,null,{"$f":"IF(G27=\"\",\"\",IF(AND(G27>0,G27<20),(15*((G27-10)/3)+100),G27))","v":""},null,null,{"$f":"IF(J27=\"\",\"\",IF(AND(J27>0,J27<20),(15*((J27-10)/3)+100),J27))","v":""},null,null,null,null,null,{"$f":"IF(COUNT(G22:G27)=0,\"\",ROUND(AVERAGE(G22:G27),0))","v":""},{"$f":"IF(COUNT(J22:J27)=0,\"\",ROUND(AVERAGE(J22:J27),0))","v":87},{"$f":"IF(COUNT(P22:R27)=0,\"\",ROUND(AVERAGE(P22:R27),0))","v":87}]
[null,null,{"$f":"\"Low Linguistic Loading = \"&P28","v":"Low Linguistic Loading = 101"},null,null,{"$f":"\"Medium Linguistic Loading = \"&Q28","v":"Medium Linguistic Loading = 93"},null,null,{"$f":"\"High Linguistic Loading = \"&S28","v":"High Linguistic Loading = 93"},null,null,null,null,null,null,{"$f":"ROUND(AVERAGE(P6:P27),0)","v":101},{"$f":"ROUND(AVERAGE(Q6:Q27),0)","v":93},{"$f":"ROUND(AVERAGE(R6:R27),0)","v":92},{"$f":"ROUND(AVERAGE(S6:S27),0)","v":93}]
[null,null,"Adapted from Flanagan, D. P., Ortiz, S. O., & Alfonso, V. (2007). Essentials of Cross-Battery Assessment, Second Edition. New York: John Wiley & Sons."]
[]
[]
[null,null,null,{"$f":"F4","v":"Low/Medium Cell Average = 100"},null,null,{"$f":"I4","v":"Low/High Cell Average = 85"}]
[null,null,null,{"$f":"F12","v":"Medium/Medium Cell Average = 86"},null,null,{"$f":"I12","v":"Medium/High Cell Average = 105"}]
[null,null,{"$f":"C20","v":"High/Low Cell Average = "},{"$f":"F20","v":"High/Medium Cell Average = "},null,null,{"$f":"I20","v":"High/High Cell Average = 87"}]
[]
[]
[null,null,null,"Low/Low",null,{"$f":"IF(COUNT(D6:D11)=0,\"\",ROUND(AVERAGE(D6:D11),0))","v":95}]
[null,null,null,"Low/Medium",null,{"$f":"IF(COUNT(G6:G11)=0,\"\",ROUND(AVERAGE(G6:G11),0))","v":100}]
[null,null,null,"Low/High",null,{"$f":"IF(COUNT(J6:J11)=0,\"\",ROUND(AVERAGE(J6:J11),0))","v":85}]
[null,null,null,"Medium/Low",null,{"$f":"IF(COUNT(D14:D19)=0,\"\",ROUND(AVERAGE(D14:D19),0))","v":106}]
[null,null,null,"Medium/Medium",null,{"$f":"IF(COUNT(G14:G19)=0,\"\",ROUND(AVERAGE(G14:G19),0))","v":86}]
[null,null,null,"Medium/High",null,{"$f":"IF(COUNT(J14:J19)=0,\"\",ROUND(AVERAGE(J14:J19),0))","v":105}]
[null,null,null,"High/Low",null,{"$f":"IF(COUNT(D22:D27)=0,\"\",ROUND(AVERAGE(E22:E27),0))","v":""}]
[null,null,null,"High/Medium",null,{"$f":"IF(COUNT(G22:G27)=0,\"\",ROUND(AVERAGE(G22:G27),0))","v":""}]
[null,null,null,"High/High",null,{"$f":"IF(COUNT(J22:J27)=0,\"\",ROUND(AVERAGE(J22:J27),0))","v":87}]