{"text_format":"1","workbook":"xlsx","n_sheets":6,"sheets":["Information","WISC IV","Shares Abilities","Subtest Graph","Cult. & Linq.","Order of Admin"],"not_rendered":{"charts":4,"images":0,"macros":0,"external_links":0,"defined_names":4,"comments":0,"pivot_tables":0},"unopened":[{"sheet":"Subtest Graph","index":3,"reason":"not_a_worksheet"},{"sheet":"Order of Admin","index":5,"reason":"not_a_worksheet"}],"bounds":{"document_bytes":16777216,"sheet_cells":100000,"rows_first":2000,"rows_last":500,"rows_between":2000,"halvings":0,"cell_chars":16384,"cell_head_chars":4096},"cells_cut":0,"cells_raw":0,"read":"whole","date_system":"1904"}

{"sheet":"Information","index":0,"n_rows":19,"n_cols":1,"rows_kept":19,"cut":false,"hidden":false,"merged":[]}
["These template sheets come with some scores already entered into cells."]
[]
["These scores act as placeholders and demonstrate what scores are necessary. The only sheets that require any user input is the WISC-IV sheet."]
[]
["All cells, except those requiring entry, are protected.  Use the TAB key to move from input cell to input cell."]
[]
["****Be sure to delete any scores that do not pertain to your particular case.****"]
[]
["We (Ron Dumont and John Willis) and The Psychological Corporation, take no responsibility for any errors made while using these templates."]
[]
["There may be some differences between some of the templates reporting and data in the WISC-IV Manuals."]
[]
["The Percentiles reported here are simple SS to Percentile lookups.  They are based upon the normal curve distribution."]
[]
["The Composite and FSIQ ranges are based upon a formula (SEE, page 37, WISC-IV Technical and Interpretive Manual)."]
[]
["Critical Values for subtest differences are approximations - because there are so many subtest combinations available, the template uses the rounded average of all possible critical values.  Please refer to page 265, WISC-IV Administration and Scoring Manual for actual values for the 10 core subtests"]
[]
["Gf-Gc configurations were adapted from Appendix A, pp. 445 – 453, The Intelligence Test Desk Reference (ITDR): Gf-Gc Cross-Battery Assessment (McGrew & Flanagan, 1998) and Table 8.3, p. 312, The Wechsler Intelligence Scales and Gf-Gc Theory (Flanagan, McGrew & Ortiz, 2000)"]

{"sheet":"WISC IV","index":1,"n_rows":466,"n_cols":187,"rows_kept":466,"cut":false,"hidden":false,"merged":[[265,15,266,16],[29,1,35,2],[92,12,92,15],[37,1,37,16],[51,1,51,16],[62,1,62,16],[53,5,53,10],[54,5,54,6],[54,7,54,8],[53,11,54,15],[154,1,154,16],[108,1,108,16],[134,1,134,16],[115,1,119,2],[121,1,125,2],[126,1,128,2],[64,11,64,15],[0,0,0,17],[1,0,1,17],[2,0,2,17],[34,3,34,5],[35,3,35,5],[4,7,4,8],[5,7,5,8],[4,13,4,14],[11,13,12,17],[130,1,132,2],[113,7,113,11],[113,13,113,15],[54,9,54,10],[68,3,69,15],[58,3,59,15],[65,2,65,3],[65,5,65,10],[55,5,55,6],[55,7,55,8],[90,12,91,15],[91,3,91,7],[91,8,91,9],[105,3,105,15],[65,11,65,15],[55,9,55,10],[55,11,55,15],[76,8,76,9],[76,12,76,15],[72,1,72,16],[74,12,75,15],[75,3,75,7],[75,10,75,11],[75,8,75,9],[92,3,92,7],[92,8,92,9],[92,10,92,11],[95,3,95,15],[88,1,88,16],[76,3,76,7],[76,10,76,11],[79,12,80,15],[80,3,80,7],[80,10,80,11],[80,8,80,9],[11,1,25,2],[7,13,9,17],[24,13,25,17],[22,13,23,17],[13,13,14,17],[20,13,21,17],[15,13,16,17],[17,13,18,17],[36,0,36,17],[64,2,64,3],[190,1,190,16],[192,5,192,6],[192,7,192,9],[191,13,192,14],[191,15,192,16],[191,3,191,10],[168,15,168,17],[166,1,166,16],[84,3,85,15],[102,3,102,7],[102,10,102,11],[102,8,102,9],[102,12,102,15],[100,12,101,15],[101,3,101,7],[101,10,101,11],[101,8,101,9],[81,3,81,7],[81,10,81,11],[81,8,81,9],[98,1,98,16],[81,12,81,15],[91,10,91,11],[206,7,206,9],[209,7,209,9],[210,7,210,9],[212,7,212,9],[195,7,195,9],[198,7,198,9],[194,7,194,10],[197,7,197,10],[201,7,201,9],[203,7,203,9],[205,13,205,14],[205,15,205,16],[209,13,209,14],[209,15,209,16],[212,13,212,14],[212,15,212,16],[225,7,225,9],[226,7,226,9],[194,13,194,14],[194,15,194,16],[197,13,197,14],[197,15,197,16],[200,13,200,14],[200,15,200,16],[203,13,203,14],[203,15,203,16],[213,7,213,9],[215,7,215,9],[217,7,217,9],[218,7,218,9],[221,7,221,9],[223,7,223,9],[205,7,205,9],[200,7,200,10],[223,13,223,14],[229,13,229,14],[223,15,223,16],[225,13,225,14],[225,15,225,16],[229,15,229,16],[215,13,215,14],[215,15,215,16],[217,13,217,14],[217,15,217,16],[221,13,221,14],[221,15,221,16],[248,1,248,16],[246,1,246,16],[231,7,231,9],[232,7,232,9],[234,7,234,9],[234,13,234,14],[234,15,234,16],[236,3,238,16],[231,13,231,14],[231,15,231,16],[252,7,252,14],[260,7,260,14],[254,15,256,16],[252,3,252,5],[262,15,264,16],[253,3,253,5],[253,8,253,13],[257,15,258,16],[260,3,260,5]]}
["Wechsler Intelligence Scale for Children - Fourth Edition© The Psychological Corporation., 2003. All Rights Reserved"]
["Dumont-Willis WISC-IV Interpretive Worksheet"]
["Use the TAB key to navigate to cells requiring input - Text highlighted in red"]
[]
[null,null,"Name: ","Andre B",null,null,"Date of Test:","2003-08-05",null,null,null,null,"Date Analyzed: ",{"$f":"NOW()","v":"2014-02-11T13:48:22.300"},null,null,null,null,null,null,{"$f":"YEAR(H5)","v":2003},{"$f":"MONTH(H5)","v":8},{"$f":"DAY(H5)","v":5},{"$f":"IF(Y6>Z5,U5-1,U5)","v":2003},{"$f":"IF(Y6>Z5,Z5+12,Z5)","v":7},{"$f":"IF(AA6>W5,V5-1,V5)","v":7},{"$f":"IF(AA6>W5,W5+30,W5)","v":35}]
[null,null,null,null,null,null,"Date of Birth:","1995-05-16",null,null,null,null,"Age:   ",{"$f":"AC7","v":"8 years, 2 months, 19 days"},null,null,null,null,null,null,null,null,null,{"$f":"YEAR(H6)","v":1995},{"$f":"MONTH(H6)","v":5},null,{"$f":"DAY(H6)","v":16}]
[null,null,null,null,null,null,null,null,null,null,null,null,null,null,null,null,null,null,null,null,null,null,null,{"$f":"X5-X6","v":8},{"$f":"Y5-Y6","v":2},null,{"$f":"AA5-AA6","v":19},null,{"$f":"X7&\" years, \"&Y7&Y8&AA7&AA8","v":"8 years, 2 months, 19 days"}]
[null,null,null,"","","","","","","","",null,null,{"$f":"IF(OR(X7<6,X7>16),\"The age computed is not supported by the WISC-IV\",\"\")","v":""},null,null,null,null,null,{"$f":"FIND(\" \",D5)","v":6},{"$f":"MID(D5,1,T8-1)","v":"Andre"},null,null,null,{"$f":"IF(Y7=1,\" month, \",\" months, \")","v":" months, "},null,{"$f":"IF(AA7=1,\" day\",\" days\")","v":" days"}]
[null,null,null,null,null,null,null,null,null,null,null,null,null,null,null,null,null,null,null,null,null,null,1,2," ",4,5,6,7,8,9,10,11,12,13]
[null,null,null,null,null,null,null,null,null,null,null,null,null,null,null,null,null,null,null,null,null,null,16,18,20,25,30,35,45,55,65,70,75,80,85]
[null,null,null,"SUBTESTS",null,"ss","VCI","PRI","WM","PS","Full Scale","PR",null,null,null,null,null,null,null,null,null,null,{"$f":"LOOKUP(N6,W10:AI10,W9:AI9)","v":{"$error":"#N/A"}},"age grp"]
[null,"Check the subtests used in the Full Scale IQ calculation (7 required).  Core subtests are those with borders",null,null,null,13,null,{"$f":"IF(F12=\"\",\"\",IF(U12=0,\"(\"&F12&\")\",F12))","v":13},null,null,{"$f":"IF(U12=0,\"\",IF(F12=\"\",\"\",F12))","v":13},{"$f":"IF(F12=\"\",\"\",LOOKUP(F12,$D$365:$W$365,$D$366:$W$366))","v":84},null,{"$f":"IF(W21>3,\"You have selected too many subtests for calculation of a Verbal Comprehension Scale\",IF(W21<3,\"You have selected too few subtests for calculation of a Verbal Comprehension Scale\",\"\"))","v":"You have selected too few subtests for calculation of a Verbal Comprehension Scale"},null,null,null,null,"bd",true,{"$f":"IF(T12=TRUE,1,0)","v":1},"p","VCI",null,"PRI","fs","psi",null,"gl",null,"wmi",null,"ps"]
[null,null,null,null,null,11,{"$f":"IF(F13=\"\",\"\",IF(U13=0,\"(\"&F13&\")\",F13))","v":"(11)"},null,null,null,{"$f":"IF(U13=0,\"\",IF(F13=\"\",\"\",F13))","v":""},63,null,null,null,null,null,null,"sim",false,{"$f":"IF(T13=TRUE,1,0)","v":0},"v",{"$f":"G28","v":22},null,{"$f":"H28","v":33},{"$f":"K28","v":91},{"$f":"I28","v":20},null,{"$f":"J28","v":16},null,{"$f":"F17+F19+F24","v":31},null,{"$f":"F14+F23","v":20}]
[null,null,null,null,null,10,null,null,{"$f":"IF(F14=\"\",\"\",IF(U14=0,\"(\"&F14&\")\",F14))","v":10},null,10,50,null,{"$f":"IF(W20>3,\"You have selected too many subtests for calculation of a Perceptual Reasoning Scale\",IF(W20<3,\"You have selected too few subtests for calculation of a Perceptual Reasoning Scale\",\"\"))","v":""},null,null,null,null,"ds",true,1,"w"]
[null,null,null,null,null,10,null,{"$f":"IF(F15=\"\",\"\",IF(U15=0,\"(\"&F15&\")\",F15))","v":10},null,null,10,50,null,null,null,null,null,null,"pcn",true,1,"p",null,null,"ss",null,null,"ss"]
[null,null,null,null,null,6,null,null,null,{"$f":"IF(F16=\"\",\"\",IF(U16=0,\"(\"&F16&\")\",F16))","v":6},6,9,null,{"$f":"IF(W22<2,\"You have too few subtest scores for calculation of a Working Memory Scale\",IF(W22>2,\"You have too many subtest scores for calculation of a Working Memory Scale\",\"\"))","v":""},null,null,null,null,"cd",true,1,"s"]
[null,null,null,null,null,11,{"$f":"IF(F17=\"\",\"\",IF(U17=0,\"(\"&F17&\")\",F17))","v":11},null,null,null,11,63,null,null,null,null,null,null,"v",true,1,"v",null,null,null,"S V C",{"$f":"IF(U13+U17+U20=3,1,0)","v":0},null,"BD MR PCn",null,{"$f":"IF(U12+U19+U15=3,1,0)","v":1}]
[null,null,null,null,null,10,null,null,{"$f":"IF(F18=\"\",\"\",IF(U18=0,\"(\"&F18&\")\",F18))","v":10},null,10,50,null,{"$f":"IF(W19<2,\"You have too few subtest scores for calculation of a Processing Speed Scale\",IF(W19>2,\"You have too many subtest scores for calculation of a Processing Speed Scale\",\"\"))","v":""},null,null,null,null,"lns",true,1,"w",null,null,null,"I V C",{"$f":"IF(U20+U17+U24=3,2,0)","v":0},null,"BD MR PCmp",null,{"$f":"IF(U12+U19+U22=3,2,0)","v":0}]
[null,null,null,null,null,10,null,{"$f":"IF(F19=\"\",\"\",IF(U19=0,\"(\"&F19&\")\",F19))","v":10},null,null,10,50,null,null,null,null,null,null,"mr",true,1,"p",{"$f":"U16+U21+U23","v":2},"psi",null,"S I C",{"$f":"IF(U13+U24+U20=3,3,0)","v":0}]
[null,null,null,null,null,11,{"$f":"IF(F20=\"\",\"\",IF(U20=0,\"(\"&F20&\")\",F20))","v":11},null,null,null,11,63,null,null,null,null,null,null,"comp",true,1,"v",{"$f":"U12+U15+U19+U22","v":3},"PRI",null,"S V I",{"$f":"IF(U13+U24+U17=3,4,0)","v":0},null,"BD PCmp PCn",null,{"$f":"IF(U12+U22+U15=3,3,0)","v":0}]
[null,null,null,null,null,10,null,null,null,{"$f":"IF(F21=\"\",\"\",IF(U21=0,\"(\"&F21&\")\",F21))","v":10},{"$f":"IF(U21=0,\"\",IF(F21=\"\",\"\",F21))","v":10},50,null,{"$f":"IF(W23>10,\"You have selected too many subtests for inclusion in a Full Scale IQ\",IF(W23<10,\"You have selected too few subtests for calculation of a Full Scale IQ\",\"\"))","v":"You have selected too few subtests for calculation of a Full Scale IQ"},null,null,null,null,"ss",true,1,"s",{"$f":"U13+U17+U20+U24+U26","v":2},"verbal",null,"WR V C",{"$f":"IF(U20+U26+U17=3,5,0)","v":0}]
[null,null,null,null,null,10,null,{"$f":"IF(F22=\"\",\"\",IF(U22=0,\"(\"&F22&\")\",F22))","v":"(10)"},null,null,"",50,null,null,null,null,null,null,"pcn",false,0,"p",{"$f":"U14+U18+U25","v":2},"wm",null,"S WR C",{"$f":"IF(U20+U13+U26=3,6,0)","v":0},null,"PCmp MR PCn",null,{"$f":"IF(U19+U22+U15=3,4,0)","v":0}]
[null,null,null,null,null,10,null,null,null,{"$f":"IF(F23=\"\",\"\",IF(U23=0,\"(\"&F23&\")\",F23))","v":"(10)"},"",50,null,{"$f":"IF(AND(W21=3,AA24>0),\"The VCI is based upon the following subtests:                                      \"&CHOOSE(AA24,Z17,Z18,Z19,Z20,Z21,Z22,Z23),IF(AA24=0,\"The combination of VCI subtests chosen cannot be used to compute an IQ.\",\"\"))","v":"The combination of VCI subtests chosen cannot be used to compute an IQ."},null,null,null,null,"ca",false,{"$f":"IF(T23=TRUE,1,0)","v":0},"s",{"$f":"SUM(U12:U26)","v":9},"total",null,"S V WR",{"$f":"IF(U26+U13+U17=3,7,0)","v":0}]
[null,null,null,null,null,10,{"$f":"IF(F24=\"\",\"\",IF(U24=0,\"(\"&F24&\")\",F24))","v":"(10)"},null,null,null,"",50,null,null,null,null,null,null,"i",false,0,"v",null,null,null,"v combo",{"$f":"SUM(AA17:AA23)","v":0},null,null,"p combo",{"$f":"SUM(AE17:AE23)","v":1},"cd or ss",{"$f":"IF(U19=1,1,IF(U17=1,2,0))","v":1}]
[null,null,null,null,null,10,null,null,{"$f":"IF(F25=\"\",\"\",IF(U25=0,\"(\"&F25&\")\",F25))","v":"(10)"},null,"",50,null,{"$f":"IF(AND(W20=3,AE24>0),\"The PRI is based upon the following subtests:                      \"&CHOOSE(AE24,AC17,AC18,AC20,AC22,),IF(AE24=0,\"The combination of PRI subtests chosen cannot be used to compute an IQ.\",\"\"))","v":"The PRI is based upon the following subtests:                      BD MR PCn"},null,null,null,null,"a",false,0,"w"]
[null,null,null,null,null,10,{"$f":"IF(F26=\"\",\"\",IF(U26=0,\"(\"&F26&\")\",F26))","v":"(10)"},null,null,null,"",50,null,null,null,null,null,null,"wr",false,0,"v"]
[]
[null,null,null,null,null,"Sums of Scaled Scores",{"$f":"SUM(G13:G26)","v":22},{"$f":"SUM(H12:H24)","v":33},{"$f":"SUM(I14:I25)","v":20},{"$f":"SUM(J16:J23)","v":16},{"$f":"SUM(K12:K26)","v":91}]
[]
[null,"Process Scores",null,"Block Design No Time Bonus",null,6,null,null,null,null,null,{"$f":"IF(F30=\"\",\"\",LOOKUP(F30,$D$365:$W$365,$D$366:$W$366))","v":9}]
[null,null,null,"Digit Span Forward",null,12,null,null,null,null,null,{"$f":"IF(F31=\"\",\"\",LOOKUP(F31,$D$365:$W$365,$D$366:$W$366))","v":75}]
[null,null,null,"Digit Span Backward",null,4,null,null,null,null,null,{"$f":"IF(F32=\"\",\"\",LOOKUP(F32,$D$365:$W$365,$D$366:$W$366))","v":2}]
[null,null,null,"Cancellation Random",null,7,null,null,null,null,null,{"$f":"IF(F33=\"\",\"\",LOOKUP(F33,$D$365:$W$365,$D$366:$W$366))","v":16}]
[null,null,null,"Cancellation Structured",null,9,null,null,null,null,null,{"$f":"IF(F34=\"\",\"\",LOOKUP(F34,$D$365:$W$365,$D$366:$W$366))","v":37}]
[null,null,null,"Longest Digit Forward (raw score)",null,null,6]
[null,null,null,"Longest Digit Backward (raw score)",null,null,2,null,null,null,null,null,null,null,null,null,null,null,null,null,"s",{"$f":"IF(F13=\"\",\"\",1)","v":1},{"$f":"IF(F13=\"\",\"\",F13)","v":11},"bd",{"$f":"IF(F12=\"\",\"\",1)","v":1},{"$f":"IF(F12=\"\",\"\",F12)","v":13},"cd",{"$f":"IF(F16=\"\",\"\",1)","v":1},{"$f":"IF(F16=\"\",\"\",F16)","v":6},"ds",{"$f":"IF(F14=\"\",\"\",1)","v":1},{"$f":"IF(F14=\"\",\"\",F14)","v":10}]
["WISC-IV Interpretive Worksheet",null,null,null,null,null,null,null,null,null,null,null,null,null,null,null,null,null,null,null,"v",{"$f":"IF(F17=\"\",\"\",1)","v":1},{"$f":"IF(F17=\"\",\"\",F17)","v":11},"pcn",{"$f":"IF(F15=\"\",\"\",1)","v":1},{"$f":"IF(F15=\"\",\"\",F15)","v":10},"ss",{"$f":"IF(F21=\"\",\"\",1)","v":1},{"$f":"IF(F21=\"\",\"\",F21)","v":10},"ln",{"$f":"IF(F18=\"\",\"\",1)","v":1},{"$f":"IF(F18=\"\",\"\",F18)","v":10}]
[null,"1. Evaluate the Full Scale IQ",null,null,null,null,null,null,null,null,null,null,null,null,null,null,null,null,null,null,"c",{"$f":"IF(F20=\"\",\"\",1)","v":1},{"$f":"IF(F20=\"\",\"\",F20)","v":11},"mr",{"$f":"IF(F19=\"\",\"\",1)","v":1},{"$f":"IF(F19=\"\",\"\",F19)","v":10},"ca",{"$f":"IF(F23=\"\",\"\",1)","v":1},{"$f":"IF(F23=\"\",\"\",F23)","v":10},"a",{"$f":"IF(F25=\"\",\"\",1)","v":1},{"$f":"IF(F25=\"\",\"\",F25)","v":10}]
[]
[null,null,null,null,null,null,null,null,null,null,null,null,null,null,null,null,null,null,null,null,null,null,null,null,null,null,null,{"$f":"SUM(AB36:AB37)","v":2},null,null,{"$f":"SUM(AE36:AE37)","v":2}]
[]
[null,null,"",null,null,null,null,"Obtained",null,"Percentile",null,"Confidence",null,null,null,null,null,null,null,null,"i",{"$f":"IF(F24=\"\",\"\",1)","v":1},{"$f":"IF(F24=\"\",\"\",F24)","v":10},"pcm",{"$f":"IF(F22=\"\",\"\",1)","v":1},{"$f":"IF(F22=\"\",\"\",F22)","v":10},null,{"$f":"SUM(AB36:AB38)","v":3},{"$f":"SUM(AC36:AC38)","v":26},null,{"$f":"SUM(AE36:AE38)","v":3},{"$f":"SUM(AF36:AF38)","v":30}]
[null,null,null,null,null,"  SS Totals",null," IQ",null,"Rank",null,"Bands",null,null,null,null,null,null,null,null,"wr",{"$f":"IF(F26=\"\",\"\",1)","v":1},{"$f":"IF(F26=\"\",\"\",F26)","v":10}]
[null,null,null,null,null,null,null,null,null,null,null,null,null,null,null,null,null,null,null,2,null,null,{"$f":"SUM(W36:W43)","v":53},null,null,{"$f":"SUM(Z36:Z43)","v":43}]
[null,null,null,"Verbal Comprehension",null,{"$f":"IF(W21=3,\"(\"&W13&\")\",\"\")","v":""},null,100,null,{"$f":"IF(H45=\"\",\"\",LOOKUP(H45,B359:BG360))","v":50},null,{"$f":"IF(H45=\"\",\"\",X45&\" - \"&Y45)","v":"93 - 107"},null,{"$f":"IF(H45=\"\",\"\",LOOKUP((LOOKUP(H45,D435:O436)+H45),$D$433:$J$434)&\" to \"&LOOKUP((LOOKUP(H45,D435:O435,D437:O437)+H45),$D$433:$J$434))","v":"Average to Average"},null,null,null,null,null,0.94,{"$f":"100+T45*(H45-100)","v":100},{"$f":"15*T45*SQRT((1-T45))","v":3.4537805373242825},{"$f":"IF(T44=1,V45*1.65,V45*1.96)","v":6.7694098531555937},{"$f":"ROUND(U45-W45,0)","v":93},{"$f":"ROUND(U45+W45,0)","v":107},null,null,null,null,{"$f":"SUM(Y36:Y43)","v":4}]
[null,null,null,"Perceptual Reasoning",null,{"$f":"IF(W20=3,\"(\"&Y13&\")\",\"\")","v":"(33)"},null,100,null,{"$f":"IF(H46=\"\",\"\",LOOKUP(H46,B359:BG360))","v":50},null,{"$f":"IF(H46=\"\",\"\",X46&\" - \"&Y46)","v":"92 - 108"},null,{"$f":"IF(H46=\"\",\"\",LOOKUP((LOOKUP(H46,D435:O436)+H46),$D$433:$J$434)&\" to \"&LOOKUP((LOOKUP(H46,D435:O435,D437:O437)+H46),$D$433:$J$434))","v":"Average to Average"},null,null,null,null,null,0.92,{"$f":"100+T46*(H46-100)","v":100},{"$f":"15*T46*SQRT((1-T46))","v":3.9032294321497418},{"$f":"IF(T44=1,V46*1.65,V46*1.96)","v":7.6503296870134943},{"$f":"ROUND(U46-W46,0)","v":92},{"$f":"ROUND(U46+W46,0)","v":108},null,{"$f":"SUM(V36:V43)","v":5},{"$f":"SUM(V36:V44)","v":5},null,{"$f":"SUM(Y36:Y43)","v":4},null,null,null,null,{"$f":"AB46+AD46+AB42+AE42","v":15}]
[null,null,null,"Working Memory",null,{"$f":"IF(AB42<2,\"\",\"(\"&AA13&\")\")","v":"(20)"},null,100,null,{"$f":"IF(H47=\"\",\"\",LOOKUP(H47,B359:BG360))","v":50},null,{"$f":"IF(H47=\"\",\"\",X47&\" - \"&Y47)","v":"92 - 108"},null,{"$f":"IF(H47=\"\",\"\",LOOKUP((LOOKUP(H47,D435:O436)+H47),$D$433:$J$434)&\" to \"&LOOKUP((LOOKUP(H47,D435:O435,D437:O437)+H47),$D$433:$J$434))","v":"Average to Average"},null,null,null,null,null,0.92,{"$f":"100+T47*(H47-100)","v":100},{"$f":"15*T47*SQRT((1-T47))","v":3.9032294321497418},{"$f":"IF(T44=1,V47*1.65,V47*1.96)","v":7.6503296870134943},{"$f":"ROUND(U47-W47,0)","v":92},{"$f":"ROUND(U47+W47,0)","v":108},"Vx=",{"$f":"W44/AA46","v":10.6},{"$f":"W44/AB46","v":10.6},{"$f":"SUM(W36:W43)","v":53},"Px=",{"$f":"Z44/AD46","v":10.75},null,{"$f":"SUM(W44+Z44+AC42+AF42)","v":152},"FSx=",{"$f":"AG47/AI46","v":10.133333333333333},null,"vp diff",{"$f":"ABS(H45-H46)","v":0}]
[null,null,null,"Processing Speed",null,{"$f":"IF(AE42<2,\"\",\"(\"&AC13&\")\")","v":"(16)"},null,109,null,{"$f":"IF(H48=\"\",\"\",LOOKUP(H48,B359:BG360))","v":73},null,{"$f":"IF(H48=\"\",\"\",X48&\" - \"&Y48)","v":"99 - 117"},null,{"$f":"IF(H48=\"\",\"\",LOOKUP((LOOKUP(H48,D435:O436)+H48),$D$433:$J$434)&\" to \"&LOOKUP((LOOKUP(H48,D435:O435,D437:O437)+H48),$D$433:$J$434))","v":"Average to High Average"},null,null,null,null,null,0.88,{"$f":"100+T48*(H48-100)","v":107.92},{"$f":"15*T48*SQRT((1-T48))","v":4.5726141319818359},{"$f":"IF(T44=1,V48*1.65,V48*1.96)","v":8.9623236986843988},{"$f":"ROUND(U48-W48,0)","v":99},{"$f":"ROUND(U48+W48,0)","v":117},"v max",{"$f":"MAX(W36:W43)","v":11},null,"p max",{"$f":"MAX(Z36:Z43)","v":13},{"$f":"IF(AA48=AD48,AA48,IF(AA48>AD48,AA48,AD48))","v":13},null,null,null,null,null,null,{"$f":"LOOKUP(AL47,D378:AR378,D387:AR387)","v":100}]
[null,null,null," Full Scale",null,{"$f":"IF(W23=10,\"(\"&Z13&\")\",\"\")","v":""},null,75,null,{"$f":"IF(H49=\"\",\"\",LOOKUP(H49,B359:BG360))","v":5},null,{"$f":"IF(H49=\"\",\"\",X49&\" - \"&Y49)","v":"71 - 81"},null,{"$f":"IF(H49=\"\",\"\",LOOKUP((LOOKUP(H49,D435:O436)+H49),$D$433:$J$434)&\" to \"&LOOKUP((LOOKUP(H49,D435:O435,D437:O437)+H49),$D$433:$J$434))","v":"Borderline to Low Average"},null,null,null,null,null,0.97,{"$f":"100+T49*(H49-100)","v":75.75},{"$f":"15*T49*SQRT((1-T49))","v":2.5201339250127175},{"$f":"IF(T44=1,V49*1.65,V49*1.96)","v":4.9394624930249265},{"$f":"ROUND(U49-W49,0)","v":71},{"$f":"ROUND(U49+W49,0)","v":81},"v min",{"$f":"MIN(W36:W43)","v":10},null,"p min",{"$f":"MIN(Z36:Z43)","v":10},{"$f":"IF(AA49=AD49,AA49,IF(AA49<AD49,AA49,AD49))","v":10},{"$f":"AE48-AE49","v":3}]
[null,null,null,null,null,null,null,null,null,null,null,null,null,null,null,null,null,null,null,null,null,null,null,null,null,"diff",{"$f":"ABS(AA48-AA49)","v":1},null,"diff",{"$f":"ABS(AD48-AD49)","v":3},null,"fs sc diff",{"$f":"AF49","v":3}]
[null,null,null,null,null,null,null,null,null,null,null,null,null,null,null,null,null,null,null,null,null,null,null,null,null,"v scat",{"$f":"IF(AA46<6,\"\",IF(AA46=6, LOOKUP(AA50,D378:V378,D379:V379),LOOKUP(AA50,D378:V378,D380:V380)))","v":""},null,"p scat",{"$f":"IF(AD46<4,\"\",LOOKUP(AD50,D378:V378,D381:V381))","v":90},null,"11fs scat",{"$f":"LOOKUP(AG50,D378:V378,D383:W383)","v":99.6},null,{"$f":"IF(AI46=14,AE53,IF(AI46=11,AG51,AG52))","v":99.8}]
[null,"2. Is the VCI versus PRI Significantly Different?                                     Note: See Table B.1 for standardization frequency",null,null,null,null,null,null,null,null,null,null,null,null,null,null,null,null,null,null,null,null,null,null,null,null,null,null,null,null,null,"1213fs scat",{"$f":"LOOKUP(AG50,D378:V378,D384:W384)","v":99.8}]
[null,null,null,null,null,null,null,null,null,null,null,null,null,null,null,null,null,null,null,null,null,null,null,null,null,null,null,null,null,"14fs scat",{"$f":"LOOKUP(AG50,D378:V378,D385:W385)","v":100}]
[null,null,null,null,null,"Significance",null,null,null,null,null,"Is there a significant difference?",null,null,null,null,null,null,null,null,null,null,null,null,{"$f":"IF(H45=H46,0,IF(H45>H46,1,2))","v":0}]
[null,null,null,{"$f":"\"VCI (\"&H45&\") vs PRI (\"&H46&\") Difference\"","v":"VCI (100) vs PRI (100) Difference"},null,"(p <  .01)",null,"(p < .05)",null,"none",null,null,null,null,null,null,null,null,null,{"$f":"ABS(H45-H46)","v":0},{"$f":"IF(T55=1,\" point\",\" points\")","v":" points"},null,null,null,{"$f":"IF(ABS(H45-H46)>8,1,-1)","v":-1}]
[null,null,null,{"$f":"IF(OR(H45=\"\",H46=\"\"),\"\",T55&U55)","v":"0 points"},null,"15 or more",null,"11",null,"0 - 10",null,{"$f":"IF(OR(H45=\"\",H46=\"\"),\"\",IF(T55>14, \"YES, p = .01\", IF(T55<11, \"NO\",\"YES, p = .05\")))","v":"NO"},null,null,null,null,null,null,null,{"$f":"IF(L56=\"NO\",0,1)","v":0},null,"Because there is no significant differences between the VCI and PRI, explain the meaning of the scales not being significantly different.",null,null,{"$f":"SUM(Y54+Y55)","v":-1}]
[null,null,null,null,null,null,null,null,null,null,null,null,null,null,null,null,null,null,null,null,null,"Because there is a significant difference between the VCI and PRI, interpret the FSIQ with caution.  Examine further steps."]
[]
[null,null,null,{"$f":"IF(L56=\"\",\"\",IF(T56=0,V56,V57))","v":"Because there is no significant differences between the VCI and PRI, explain the meaning of the scales not being significantly different."}]
[]
[]
[]
[null,"3. Is the VCI versus PRI Difference Abnormally Large?                         Note: See Table B.2 for standardization frequency"]
[null,null,null,null,null,null,null,null,null,null,null,null,null,null,null,null,null,null,null,null,null,null,1,2,3,4,5]
[null,null,{"$f":"\"VCI (\"&H45&\") vs PRI (\"&H46&\") Difference\"","v":"VCI (100) vs PRI (100) Difference"},null,null,"Size of Difference needed for abnormality",null,null,null,null,null,"Is Size of Difference Abnormal?",null,null,null,null,null,null,null,{"$f":"IF(H45=H46,0,IF(H45>H46,1,2))","v":0},{"$f":"IF(H49>119,5,IF(H49>109,4,IF(H49>89,3,IF(H49>79,2,1))))","v":1},1,15,19,16,15,20]
[null,null,{"$f":"D56&\" (\"&T66&\")\"","v":"0 points (V = P)"},null,null,{"$f":"INDEX(W65:AA66,T65,U65)","v":18},null,null,null,null,null,{"$f":"IF(D56=\"\",\"\",IF(T55<F66,\"NO\",\"YES\"))","v":"NO"},null,null,null,null,null,null,null,{"$f":"IF(H45=H46,\"V = P\",IF(H45>H46,\"V > P\",\"V < P\"))","v":"V = P"},"IQ group",2,18,18,16,18,17]
[]
[null,null,null,null,null,null,null,null,null,null,null,null,null,null,null,null,null,null,null,{"$f":"IF(L66=\"NO\",0,1)","v":0},null,"Because no abnormal differences are found, determine if the noted differences are interpretable."]
[null,null,null,{"$f":"IF(L66=\"\",\"\",IF(T68=0,V68,V69))","v":"Because no abnormal differences are found, determine if the noted differences are interpretable."},null,null,null,null,null,null,null,null,null,null,null,null,null,null,null,null,null,"Because an abnormal difference was found, explain the abnormally large VCI vs PRI difference."]
[]
[]
[]
[null,"4. Are the VCI and PRI composites interpretable?                               Note: See Table B.6 for standardization frequency"]
[]
[null,null,null,"A. Is there abnormal VCI scatter?",null,null,null,null,null,null,null,null,"Is there abnormal scatter?"]
[null,null,null,"Verbal Subtests High-Low Difference",null,null,null,null,"Normal",null,"Abnormal"]
[null,null,null,{"$f":"AA50&U77&\" between \"&AA46&\" subtests\"","v":"1 point between 5 subtests"},null,null,null,null,"0 - 5",null,"6 or more",null,{"$f":"IF(AA50>5,\"YES\",\"NO\")","v":"NO"},null,null,null,null,null,null,null,{"$f":"IF(AA50=1,\" point\",\" points\")","v":" point"}]
[]
[]
[null,null,null,"B. Is there abnormal PRI scatter?",null,null,null,null,null,null,null,null,"Is there abnormal scatter?"]
[null,null,null,"Perceptual Reasoning Subtests High-Low Difference",null,null,null,null,"Normal",null,"Abnormal",null,null,null,null,null,null,null,null,null,{"$f":"IF(M77=\"NO\",0,1)","v":0}]
[null,null,null,{"$f":"AD50&U83&\" between \"&AD46&\" subtests\"","v":"3 points between 4 subtests"},null,null,null,null,"0 - 7",null,"8 or more",null,{"$f":"IF(AD50>7,\"YES\",\"NO\")","v":"NO"},null,null,null,null,null,null,null,{"$f":"IF(M82=\"NO\",0,1)","v":0},{"$f":"U81+U82","v":0},"Because each answers to A and B was NO, the VCI versus PRI discrepancy is interpretable. "]
[null,null,null,null,null,null,null,null,null,null,null,null,null,null,null,null,null,null,null,null,{"$f":"IF(AD50=1,\" point\",\" points\")","v":" points"},null,"Because an answer to either A or B was YES, the VCI versus PRI discrepancy differences should probably not be interpreted. "]
[]
[null,null,null,{"$f":"IF(V82=0,W82,W83)","v":"Because each answers to A and B was NO, the VCI versus PRI discrepancy is interpretable. "}]
[]
[]
[]
[null,"5. Determine if the Working Memory Index is interpretable.                 Note: See Table B.4 for standardization frequency"]
[]
[null,null,null,"A. Is there a significant difference between the WMI subtests?",null,null,null,null,null,null,null,null,"Is there abnormal scatter?"]
[null,null,null,{"$f":"IF(AB32=1,\"No Index Computed\",\"WMI Subtests [ DS (\"&F14&\") LNS (\"&F18&\") ] Difference \")","v":"WMI Subtests [ DS (10) LNS (10) ] Difference "},null,null,null,null,"Normal",null,"Abnormal",null,null,null,null,null,null,null,null,null,{"$f":"ABS(AF36-AF37)","v":0}]
[null,null,null,{"$f":"U92&U94","v":"0 points"},null,null,null,null,"0 - 4",null,"5 or more",null,{"$f":"IF(AE40<>2,\"\",IF(U92>4,\"YES\",\"NO\"))","v":"NO"},null,null,null,null,null,null,null,{"$f":"IF(M93=\"NO\",0,1)","v":0}]
[null,null,null,null,null,null,null,null,null,null,null,null,null,null,null,null,null,null,null,null,{"$f":"IF(U92=1,\" point\",\" points\")","v":" points"}]
[]
[null,null,null,{"$f":"IF(AE40<>2,\"No index computed\",IF(U93=0,\"The WMI may be interpreted.\",\"Because of subtest differences in the WMI, do not interpret WMI.\"))","v":"The WMI may be interpreted."}]
[]
[]
[null,"6. Determine if the Processing Speed Index is interpretable.                 Note: See Table B.4 for standardization frequency"]
[]
[null,null,null,"A. Is there a significant difference between the PSI subtests?",null,null,null,null,null,null,null,null,"Is there abnormal scatter?"]
[null,null,null,{"$f":"IF(AB42=1,\"No Index Computed\",\"PSI Subtests [ SS (\"&F21&\") Cd (\"&F16&\") ] Difference \")","v":"PSI Subtests [ SS (10) Cd (6) ] Difference "},null,null,null,null,"Normal",null,"Abnormal",null,null,null,null,null,null,null,null,null,{"$f":"ABS(AC36-AC37)","v":4}]
[null,null,null,{"$f":"U102&U104","v":"4 points"},null,null,null,null,"0 - 3",null,"4 or more",null,{"$f":"IF(AB40<>2,\"\",IF(U102>3,\"YES\",\"NO\"))","v":"YES"},null,null,null,null,null,null,null,{"$f":"IF(M103=\"NO\",0,1)","v":1}]
[null,null,null,null,null,null,null,null,null,null,null,null,null,null,null,null,null,null,null,null,{"$f":"IF(U102=1,\" point\",\" points\")","v":" points"}]
[]
[null,null,null,{"$f":"IF(AB40<>2,\"No index computed\",IF(U103=0,\"The PSI may be interpreted.\",\"Because of subtest differences in the PSI, do not interpret PSI.\"))","v":"Because of subtest differences in the PSI, do not interpret PSI."}]
[]
[]
[null,"7. Interpret significant strengths and weaknesses."]
[null,null,null,null,null,null,null,null,"Verbal Comprehension mean",null,{"$f":"AA47","v":10.6},{"$f":"\"   based on \"&AA46&\" subtests\"","v":"   based on 5 subtests"}]
[null,null,null,null,null,null,null,null,"Perceptual Reasoning mean",null,{"$f":"AE47","v":10.75},{"$f":"\"   based on \"&AD46&\" subtests\"","v":"   based on 4 subtests"}]
[null,null,null,null,null,null,null,null,"Full Scale mean",null,{"$f":"AI47","v":10.133333333333333},{"$f":"\"   based on \"&AI46&\" subtests\"","v":"   based on 15 subtests"}]
[]
[null,null,null,null,null,null,null," Verbal / Perceptual Statistics",null,null,null,null,null,"Full Scale Statistics"]
[null,null,null,null,null,"ss",null,null,"Crit. Value",null,"Deviation",null,null,"Crit. Value",null,"Deviation"]
[null,"Verbal",null,"Similarities",null,{"$f":"IF(F13=\"\",\"\",F13)","v":11},null,null,{"$f":"IF(F116=\"\",\"\",IF($AB$46<3,\"\",2))","v":2},null,{"$f":"IF(F116=\"\",\"\",(F116-$K$110))","v":0.40000000000000036},{"$f":"IF(F116=\"\",\"\",IF(SUM(U116+V116)=4,\"s\",IF(SUM(U116+V116)=2,\"w\",\"\")))","v":""},null,{"$f":"IF(F116=\"\",\"\",IF($AI$46<7,\"\",3))","v":3},null,{"$f":"IF(N116=\"\",\"\",($F116-K$112))","v":0.86666666666666714},{"$f":"IF(F116=\"\",\"\",IF(SUM(W116+X116)=4,\"s\",IF(SUM(W116+X116)=2,\"w\",\"\")))","v":""},null,null,null,{"$f":"IF(ABS(K116)>I116,3,0)","v":0},{"$f":"SIGN(K116)","v":1},{"$f":"IF(ABS(P116)>N116,3,0)","v":0},{"$f":"SIGN(P116)","v":1},null,null,{"$f":"IF(W116=0,0,1)","v":0},{"$f":"Q116","v":""}]
[null,null,null,"Vocabulary",null,{"$f":"IF(F17=\"\",\"\",F17)","v":11},null,null,{"$f":"IF(F117=\"\",\"\",IF($AB$46<3,\"\",2))","v":2},null,{"$f":"IF(F117=\"\",\"\",(F117-$K$110))","v":0.40000000000000036},{"$f":"IF(F117=\"\",\"\",IF(SUM(U117+V117)=4,\"s\",IF(SUM(U117+V117)=2,\"w\",\"\")))","v":""},null,{"$f":"IF(F117=\"\",\"\",IF($AI$46<7,\"\",3))","v":3},null,{"$f":"IF(N117=\"\",\"\",($F117-K$112))","v":0.86666666666666714},{"$f":"IF(F117=\"\",\"\",IF(SUM(W117+X117)=4,\"s\",IF(SUM(W117+X117)=2,\"w\",\"\")))","v":""},null,null,null,0,1,{"$f":"IF(ABS(P117)>N117,3,0)","v":0},{"$f":"SIGN(P117)","v":1},null,null,{"$f":"IF(W117=0,0,1)","v":0},{"$f":"Q117","v":""}]
[null,null,null,"Comprehension",null,{"$f":"IF(F20=\"\",\"\",F20)","v":11},null,null,{"$f":"IF(F118=\"\",\"\",IF($AB$46<3,\"\",2))","v":2},null,{"$f":"IF(F118=\"\",\"\",(F118-$K$110))","v":0.40000000000000036},"",null,{"$f":"IF(F118=\"\",\"\",IF($AI$46<7,\"\",IF(AI46>12,3,2)))","v":3},null,{"$f":"IF(N118=\"\",\"\",($F118-K$112))","v":0.86666666666666714},{"$f":"IF(F118=\"\",\"\",IF(SUM(W118+X118)=4,\"s\",IF(SUM(W118+X118)=2,\"w\",\"\")))","v":""},null,null,null,0,1,0,1,null,null,0,{"$f":"Q118","v":""},null,null,null,{"$f":"LOOKUP(#REF!,R390:W390,R391:W391)","v":{"$error":"#REF!"}},{"$f":"LOOKUP(#REF!,R392:W392,R393:W393)","v":{"$error":"#REF!"}},{"$f":"LOOKUP(#REF!,R394:W394,R395:W395)","v":{"$error":"#REF!"}},{"$f":"LOOKUP(#REF!,R396:W396,R397:W397)","v":{"$error":"#REF!"}},{"$f":"LOOKUP(#REF!,R398:W398,R399:W399)","v":{"$error":"#REF!"}},{"$f":"CHOOSE(AJ52,AF118,AG118,AH118,AI118,AJ118)","v":{"$error":"#VALUE!"}}]
[null,null,null,"Information",null,{"$f":"IF(F24=\"\",\"\",F24)","v":10},null,null,{"$f":"IF(F119=\"\",\"\",IF($AB$46<3,\"\",2))","v":2},null,{"$f":"IF(F119=\"\",\"\",(F119-$K$110))","v":-0.59999999999999964},"",null,{"$f":"IF(F119=\"\",\"\",IF($AI$46<7,\"\",3))","v":3},null,{"$f":"IF(N119=\"\",\"\",($F119-K$112))","v":-0.13333333333333286},{"$f":"IF(F119=\"\",\"\",IF(SUM(W119+X119)=4,\"s\",IF(SUM(W119+X119)=2,\"w\",\"\")))","v":""},null,null,null,0,-1,0,-1,null,null,0,{"$f":"Q119","v":""},null,null,null,{"$f":"LOOKUP(#REF!,D390:I390,D391:I391)","v":{"$error":"#REF!"}},{"$f":"LOOKUP(#REF!,D392:I392,D393:I393)","v":{"$error":"#REF!"}},{"$f":"LOOKUP(#REF!,D394:I394,D395:I395)","v":{"$error":"#REF!"}},{"$f":"LOOKUP(#REF!,D396:I396,D397:I397)","v":{"$error":"#REF!"}},{"$f":"LOOKUP(#REF!,D398:I398,D399:I399)","v":{"$error":"#REF!"}},{"$f":"CHOOSE(AJ52,AF119,AG119,AH119,AI119,AJ119)","v":{"$error":"#VALUE!"}}]
[null,null,null,"Word Reasoning",null,{"$f":"IF(F26=\"\",\"\",F26)","v":10},null,null,{"$f":"IF(F120=\"\",\"\",IF($AB$46<3,\"\",2))","v":2},null,{"$f":"IF(F120=\"\",\"\",(F120-$K$110))","v":-0.59999999999999964},"",null,{"$f":"IF(F120=\"\",\"\",IF($AI$46<7,\"\",3))","v":3},null,{"$f":"IF(N120=\"\",\"\",($F120-K$112))","v":-0.13333333333333286},{"$f":"IF(F120=\"\",\"\",IF(SUM(W120+X120)=4,\"s\",IF(SUM(W120+X120)=2,\"w\",\"\")))","v":""},null,null,null,0,-1,0,-1,null,null,0,{"$f":"Q120","v":""},null,null,null,{"$f":"LOOKUP(#REF!,K390:P390,K391:P391)","v":{"$error":"#REF!"}},{"$f":"LOOKUP(#REF!,K392:P392,K393:P393)","v":{"$error":"#REF!"}},{"$f":"LOOKUP(#REF!,K394:P394,K395:P395)","v":{"$error":"#REF!"}},{"$f":"LOOKUP(#REF!,K396:P396,K397:P397)","v":{"$error":"#REF!"}},{"$f":"LOOKUP(#REF!,K398:P398,K399:P399)","v":{"$error":"#REF!"}},{"$f":"CHOOSE(AJ52,AF120,AG120,AH120,AI120,AJ120)","v":{"$error":"#VALUE!"}}]
[null,null,null,null,null,null,null,null,null,null,null,null,null,null,null,null,null,null,null,null,0,0,null,null,null,null,0,{"$f":"Q122","v":""}]
[null,"Perceptual",null,"Block Design",null,{"$f":"IF(F12=\"\",\"\",F12)","v":13},null,null,{"$f":"IF(F122=\"\",\"\",IF($AD$46<3,\"\",IF(AD46=5,3,2)))","v":2},null,{"$f":"IF(F122=\"\",\"\",(F122-$K$111))","v":2.25},"s",null,{"$f":"IF(F122=\"\",\"\",IF($AI$46<7,\"\",3))","v":3},null,{"$f":"IF(N122=\"\",\"\",($F122-K$112))","v":2.8666666666666671},{"$f":"IF(F122=\"\",\"\",IF(SUM(W122+X122)=4,\"s\",IF(SUM(W122+X122)=2,\"w\",\"\")))","v":""},null,null,null,3,1,0,1,null,null,0,{"$f":"Q123","v":""}]
[null,null,null,"Picture Concepts",null,{"$f":"IF(F15=\"\",\"\",F15)","v":10},null,null,{"$f":"IF(F123=\"\",\"\",IF($AB$46<3,\"\",2))","v":2},null,{"$f":"IF(F123=\"\",\"\",(F123-$K$111))","v":-0.75},"",null,{"$f":"IF(F123=\"\",\"\",IF($AI$46<7,\"\",3))","v":3},null,{"$f":"IF(N123=\"\",\"\",($F123-K$112))","v":-0.13333333333333286},"",null,null,null,0,-1,0,-1,null,null,0,{"$f":"Q124","v":""}]
[null,null,null,"Matrix Reasoning",null,{"$f":"IF(F19=\"\",\"\",F19)","v":10},null,null,{"$f":"IF(F124=\"\",\"\",IF($AB$46<3,\"\",2))","v":2},null,{"$f":"IF(F124=\"\",\"\",(F124-$K$111))","v":-0.75},"",null,{"$f":"IF(F124=\"\",\"\",IF($AI$46<7,\"\",3))","v":3},null,{"$f":"IF(N124=\"\",\"\",($F124-K$112))","v":-0.13333333333333286},"",null,null,null,0,-1,0,-1,null,null,0,{"$f":"Q125","v":""}]
[null,null,null,"Picture Completion",null,{"$f":"IF(F22=\"\",\"\",F22)","v":10},null,null,{"$f":"IF(F125=\"\",\"\",IF($AB$46<3,\"\",2))","v":2},null,{"$f":"IF(F125=\"\",\"\",(F125-$K$111))","v":-0.75},"",null,{"$f":"IF(F125=\"\",\"\",IF($AI$46<7,\"\",3))","v":3},null,{"$f":"IF(N125=\"\",\"\",($F125-K$112))","v":-0.13333333333333286},"",null,null,null,0,-1,0,-1,null,null,0,{"$f":"Q126","v":0}]
[null,null,null,null,null,null,null,null,null,null,null,null,null,null,null,null,null,null,null,null,null,null,null,null,null,null,0,{"$f":"Q128","v":""}]
[null,"WM",null,"Digit Span",null,{"$f":"IF(F14=\"\",\"\",F14)","v":10},null,null,null,null,null,null,null,{"$f":"IF(F127=\"\",\"\",IF($AI$46<7,\"\",3))","v":3},null,{"$f":"IF(N127=\"\",\"\",($F127-K$112))","v":-0.13333333333333286},"",null,null,null,null,null,0,-1]
[null,null,null,"Letter-Number Sequence",null,{"$f":"IF(F18=\"\",\"\",F18)","v":10},null,null,null,null,null,null,null,{"$f":"IF(F128=\"\",\"\",IF($AI$46<7,\"\",3))","v":3},null,{"$f":"IF(N128=\"\",\"\",($F128-K$112))","v":-0.13333333333333286},"",null,null,null,null,null,0,-1,null,null,0,{"$f":"Q129","v":""}]
[null,null,null,"Arithmetic",null,{"$f":"IF(F25=\"\",\"\",F25)","v":10},null,null,null,null,null,{"$f":"IF(F129=\"\",\"\",IF(SUM(U128+V128)=4,\"s\",IF(SUM(U128+V128)=2,\"w\",\"\")))","v":""},null,{"$f":"IF(F129=\"\",\"\",IF($AI$46<7,\"\",3))","v":3},null,{"$f":"IF(N129=\"\",\"\",($F129-K$112))","v":-0.13333333333333286},"",null,null,null,null,null,0,-1,null,null,0]
[]
[null,"Pr.  Spd.",null,"Coding",null,{"$f":"IF(F16=\"\",\"\",F16)","v":6},null,null,null,null,null,null,null,{"$f":"IF(F131=\"\",\"\",IF($AI$46<7,\"\",3))","v":3},null,{"$f":"IF(N131=\"\",\"\",($F131-K$112))","v":-4.1333333333333329},"w",null,null,null,null,null,3,-1,null,null,1]
[null,null,null,"Symbol Search",null,{"$f":"IF(F21=\"\",\"\",F21)","v":10},null,null,null,null,null,null,null,{"$f":"IF(F132=\"\",\"\",IF($AI$46<7,\"\",3))","v":3},null,{"$f":"IF(N132=\"\",\"\",($F132-K$112))","v":-0.13333333333333286},"",null,null,null,null,null,0,-1,null,null,{"$f":"SUM(AA116:AA122)","v":0}]
[null,null,null,"Cancellation",null,{"$f":"IF(F23=\"\",\"\",F23)","v":10},null,null,null,null,null,null,null,{"$f":"IF(F133=\"\",\"\",IF($AI$46<7,\"\",3))","v":3},null,{"$f":"IF(N133=\"\",\"\",($F133-K$112))","v":-0.13333333333333286},"",null,null,null,null,null,0,-1]
[null,null,null,null,null,null,null,null,null,null,null,null,null,null,null,null,null,null,null,null,null,null,null,null,null,null,{"$f":"SUM(AA123:AA131)","v":1},null,"  I","Ds","V","A","C","S"," PC"," PA"," BD"," OA","Dsm"]
[null,"8. Compare relevant subtest groupings (.05 level of significance)"]
[]
[null,null,{"$f":"\"Word Reasoning (\"&F120&\")  \"&V137&\"  Matrix Reasoning (\"&F124&\")\"","v":"Word Reasoning (10)  =  Matrix Reasoning (10)"},null,null,null,null,null,null,null,{"$f":"IF(OR(F120=\"\",F124=\"\"),\"\",W137&\" point \"&X137&\" difference\")","v":"0 point nonsignificant difference"},null,null,null,null,null,null,null,null,"wr/mr",{"$f":"IF(F120=F124,1,IF(F120>F124,2,3))","v":1},{"$f":"CHOOSE(U137,\"=\",\">\",\"<\")","v":"="},{"$f":"ABS(F120-F124)","v":0},{"$f":"IF(W137>3,\"significant\",\"nonsignificant\")","v":"nonsignificant"}]
[]
[null,null,{"$f":"\"Matrix Reasoning (\"&F124&\") \"&V139&\"  Block Design (\"&F122&\")\"","v":"Matrix Reasoning (10) <  Block Design (13)"},null,null,null,null,null,null,null,{"$f":"IF(OR(F124=\"\",F122=\"\"),\"\",W139&\" point \"&X139&\" difference\")","v":"3 point significant difference"},null,null,null,null,null,null,null,null,"mr/bd",{"$f":"IF(F124=F122,1,IF(F124>F122,2,3))","v":3},{"$f":"CHOOSE(U139,\"=\",\">\",\"<\")","v":"<"},{"$f":"ABS(F122-F124)","v":3},{"$f":"IF(W139>2,\"significant\",\"nonsignificant\")","v":"significant"}]
[]
[null,null,{"$f":"\"Similarities (\"&F116&\")  \"&V141&\"  Picture Concepts (\"&F123&\")\"","v":"Similarities (11)  >  Picture Concepts (10)"},null,null,null,null,null,null,null,{"$f":"IF(OR(F116=\"\",F123=\"\"),\"\",W141&\" point \"&X141&\" difference\")","v":"1 point nonsignificant difference"},null,null,null,null,null,null,null,null,"sim/pcm",{"$f":"IF(F116=F123,1,IF(F116>F123,2,3))","v":2},{"$f":"CHOOSE(U141,\"=\",\">\",\"<\")","v":">"},{"$f":"ABS(F123-F116)","v":1},{"$f":"IF(W141>3,\"significant\",\"nonsignificant\")","v":"nonsignificant"}]
[]
[null,null,{"$f":"\"Information (\"&F119&\")  \"&V143&\"  Comprehension (\"&F118&\")\"","v":"Information (10)  <  Comprehension (11)"},null,null,null,null,null,null,null,{"$f":"IF(OR(F119=\"\",F118=\"\"),\"\",W143&\" point \"&X143&\" difference\")","v":"1 point nonsignificant difference"},null,null,null,null,null,null,null,null,"i/c",{"$f":"IF(F119=F118,1,IF(F119>F118,2,3))","v":3},{"$f":"CHOOSE(U143,\"=\",\">\",\"<\")","v":"<"},{"$f":"ABS(F119-F118)","v":1},{"$f":"IF(W143>3,\"significant\",\"nonsignificant\")","v":"nonsignificant"}]
[]
[null,null,{"$f":"\"Digit Span (\"&F127&\")  \"&V145&\"  Arithmetic (\"&F129&\")\"","v":"Digit Span (10)  =  Arithmetic (10)"},null,null,null,null,null,null,null,{"$f":"IF(OR(F127=\"\",F129=\"\"),\"\",W145&\" point \"&X145&\" difference\")","v":"0 point nonsignificant difference"},null,null,null,null,null,null,null,null,"ds/a",{"$f":"IF(F127=F129,1,IF(F127>F129,2,3))","v":1},{"$f":"CHOOSE(U145,\"=\",\">\",\"<\")","v":"="},{"$f":"ABS(F127-F129)","v":0},{"$f":"IF(W145>2,\"significant\",\"nonsignificant\")","v":"nonsignificant"}]
[]
[null,null,{"$f":"\"Digit Span (\"&F127&\")  \"&V147&\"  Letter Number Sequence (\"&F128&\")\"","v":"Digit Span (10)  =  Letter Number Sequence (10)"},null,null,null,null,null,null,null,{"$f":"IF(OR(F127=\"\",F128=\"\"),\"\",W147&\" point \"&X147&\" difference\")","v":"0 point nonsignificant difference"},null,null,null,null,null,null,null,null,"DS/lns",{"$f":"IF(F127=F128,1,IF(F127>F128,2,3))","v":1},{"$f":"CHOOSE(U147,\"=\",\">\",\"<\")","v":"="},{"$f":"ABS(F127-F128)","v":0},{"$f":"IF(W147>2,\"significant\",\"nonsignificant\")","v":"nonsignificant"}]
[]
[null,null,{"$f":"\"Arithmetic (\"&F129&\")   \"&V149&\"  Letter Number Sequence (\"&F128&\")\"","v":"Arithmetic (10)   =  Letter Number Sequence (10)"},null,null,null,null,null,null,null,{"$f":"IF(OR(F128=\"\",F129=\"\"),\"\",W149&\" point \"&X149&\" difference\")","v":"0 point nonsignificant difference"},null,null,null,null,null,null,null,null,"a/lns",{"$f":"IF(F129=F128,1,IF(F129>F128,2,3))","v":1},{"$f":"CHOOSE(U149,\"=\",\">\",\"<\")","v":"="},{"$f":"ABS(F129-F128)","v":0},{"$f":"IF(W149>2,\"significant\",\"nonsignificant\")","v":"nonsignificant"}]
[null,null,null,null,null,null,null,null,null,null,{"$f":"IF(OR(F128=\"\",F130=\"\"),\"\",#REF!&\" point \"&#REF!&\" difference\")","v":""}]
[null,null,{"$f":"\"Coding (\"&F131&\") \"&V151&\"  Symbol Search (\"&F132&\")\"","v":"Coding (6) <  Symbol Search (10)"},null,null,null,null,null,null,null,{"$f":"IF(OR(F131=\"\",F132=\"\"),\"\",W151&\" point \"&X151&\" difference\")","v":"4 point significant difference"},null,null,null,null,null,null,null,null,"cd/ss",{"$f":"IF(F131=F132,1,IF(F131>F132,2,3))","v":3},{"$f":"CHOOSE(U151,\"=\",\">\",\"<\")","v":"<"},{"$f":"ABS(F131-F132)","v":4},{"$f":"IF(W151>3,\"significant\",\"nonsignificant\")","v":"significant"}]
[]
[null,null,{"$f":"\"Coding (\"&F131&\") \"&V153&\"  Cancellation (\"&F133&\")\"","v":"Coding (6) <  Cancellation (10)"},null,null,null,null,null,null,null,{"$f":"IF(OR(F131=\"\",F133=\"\"),\"\",W153&\" point \"&X153&\" difference\")","v":"4 point significant difference"},null,null,null,null,null,null,null,null,"cd/ca",{"$f":"IF(F131=F133,1,IF(F131>F133,2,3))","v":3},{"$f":"CHOOSE(U153,\"=\",\">\",\"<\")","v":"<"},{"$f":"ABS(F131-F133)","v":4},{"$f":"IF(W153>3,\"significant\",\"nonsignificant\")","v":"significant"}]
[]
[null,"9. Process comparisons"]
[]
[null,null,{"$f":"\"Block Design (\"&F12&\")  \"&V157&\"  Block Design No Time Bonus (\"&F30&\")\"","v":"Block Design (13)  >  Block Design No Time Bonus (6)"},null,null,null,null,null,null,null,{"$f":"IF(OR(F12=\"\",F30=\"\"),\"\",W157&\" point \"&X157&\" difference\")","v":"7 point significant difference"},null,null,null,null,null,null,null,null,"DS/lns",{"$f":"IF(F12=F30,1,IF(F12>F30,2,3))","v":2},{"$f":"CHOOSE(U157,\"=\",\">\",\"<\")","v":">"},{"$f":"ABS(F12-F30)","v":7},{"$f":"IF(W157>3,\"significant\",\"nonsignificant\")","v":"significant"}]
[]
[null,null,{"$f":"\"Digit Span Forward (\"&F31&\")  \"&V159&\"  Digit Span Backward (\"&F32&\")\"","v":"Digit Span Forward (12)  >  Digit Span Backward (4)"},null,null,null,null,null,null,null,{"$f":"IF(OR(F31=\"\",F32=\"\"),\"\",W159&\" point \"&X159&\" difference\")","v":"8 point significant difference"},null,null,null,null,null,null,null,null,"dsf/dsb",{"$f":"IF(F31=F32,1,IF(F31>F32,2,3))","v":2},{"$f":"CHOOSE(U159,\"=\",\">\",\"<\")","v":">"},{"$f":"ABS(F31-F32)","v":8},{"$f":"IF(W159>3,\"significant\",\"nonsignificant\")","v":"significant"}]
[]
[null,null,{"$f":"\"Longest Digit Span Forward (\"&G35&\")  \"&V161&\"  Longest Span Backward (\"&G36&\")\"","v":"Longest Digit Span Forward (6)  >  Longest Span Backward (2)"},null,null,null,null,null,null,null,{"$f":"IF(OR(G35=\"\",G36=\"\"),\"\",W161&\" point \"&X161&\" difference\")","v":"4 point significant difference"},null,null,null,null,null,null,null,null,"ldf/ldb",{"$f":"IF(G35=G36,1,IF(G35>G36,2,3))","v":2},{"$f":"CHOOSE(U161,\"=\",\">\",\"<\")","v":">"},{"$f":"ABS(G35-G36)","v":4},{"$f":"IF(W161>3,\"significant\",\"nonsignificant\")","v":"significant"}]
[]
[null,null,{"$f":"\"Cancellation Random (\"&F33&\")  \"&V163&\"  Cancellation Structured (\"&F34&\")\"","v":"Cancellation Random (7)  <  Cancellation Structured (9)"},null,null,null,null,null,null,null,{"$f":"IF(OR(F33=\"\",F34=\"\"),\"\",W163&\" point \"&X163&\" difference\")","v":"2 point nonsignificant difference"},null,null,null,null,null,null,null,null,"car/cas",{"$f":"IF(F33=F34,1,IF(F33>F34,2,3))","v":3},{"$f":"CHOOSE(U163,\"=\",\">\",\"<\")","v":"<"},{"$f":"ABS(F33-F34)","v":2},{"$f":"IF(W163>4,\"significant\",\"nonsignificant\")","v":"nonsignificant"}]
[]
[]
[]
[null,"10. Relevant subtest cluster groupings",null,null,null,null,null,null,null,null,null,null,null,null,null,null,null,null,null,null,{"$f":"I170","v":10},{"$f":"M170","v":10},{"$f":"F129","v":10}]
[]
[null,null,null,null,null,null,null,null,null,null,null,null,null,null,null,"Standard Score",null,null,null,"sum","count","max","min","range"]
[null,null,"Fluid Reasoning Gf:",null,"Matrix Reasoning",null,null,null,{"$f":"F124","v":10},"Picture Concepts",null,null,{"$f":"F123","v":10},{"$f":"\"Arithmetic      \"&F129","v":"Arithmetic      10"},null,null,{"$f":"AA170","v":100},null,null,{"$f":"I170+M170+F129","v":30},{"$f":"COUNT(U167:W167)","v":3},{"$f":"MAX(I170:P170)","v":10},{"$f":"MIN(I170:P170)","v":10},{"$f":"ABS(V170-W170)","v":0},{"$f":"T170/U170","v":10},{"$f":"15*(Y170-10)/3+100","v":100},{"$f":"IF(X170>4,\"DNI\",Z170)","v":100}]
[]
[null,null,"Nonverbal Fluid Reasoning Gf:",null,"Matrix Reasoning",null,null,null,{"$f":"F124","v":10},"Picture Concepts ",null,null,{"$f":"F123","v":10},null,null,null,{"$f":"AA172","v":100},null,null,{"$f":"I172+M172","v":20},{"$f":"COUNT(I172:P172)","v":2},{"$f":"MAX(I172:P172)","v":10},{"$f":"MIN(I172:P172)","v":10},{"$f":"ABS(V172-W172)","v":0},{"$f":"T172/U172","v":10},{"$f":"15*(Y172-10)/3+100","v":100},{"$f":"IF(X172>4,\"DNI\",Z172)","v":100}]
[]
[null,null,"Verbal Fluid Reasoning Gf: ",null,"Word Reasoning",null,null,null,{"$f":"F120","v":10},"Similarities ",null,null,{"$f":"F116","v":11},null,null,null,102.5,null,null,{"$f":"I174+M174","v":21},2,11,10,1,10.5,102.5,102.5]
[]
[null,null,"Visual Processing Gv:",null,"Block Design ",null,null,null,{"$f":"F122","v":13},"Picture Concepts",null,null,{"$f":"F123","v":10},null,null,null,107.5,null,null,23,2,13,10,3,11.5,107.5,107.5]
[]
[null,null,"Lexical Knowledge Gc:",null,"Word Reasoning ",null,null,null,{"$f":"I174","v":10},"Vocabulary",null,null,{"$f":"F117","v":11},null,null,null,102.5,null,null,21,2,11,10,1,10.5,102.5,102.5]
[]
[null,null,"General Information Gc:",null,"Comprehension ",null,null,null,{"$f":"F118","v":11},"Information",null,null,{"$f":"F119","v":10},null,null,null,102.5,null,null,21,2,11,10,1,10.5,102.5,102.5]
[]
[null,null,"Long Term Memory Gc:",null,"Vocabulary ",null,null,null,{"$f":"F117","v":11},"Information",null,null,{"$f":"F119","v":10},null,null,null,102.5,null,null,21,2,11,10,1,10.5,102.5,102.5]
[]
[null,null,"Short Term Memory Gsm:",null,"Letter-Number Seq. ",null,null,null,{"$f":"F128","v":10},"Digit Span",null,null,{"$f":"F127","v":10},null,null,null,100,null,null,20,2,10,10,0,10,100,100]
[]
[null,null,null,null,null,null,null,null,null,null,null,null,null,null,"Note: DNI = Do not interpret"]
[]
[]
[]
[]
[null,"11. WISC-IV Subtests and Proposed Broad and Narrow Abilities and Cultural and Linguistic Demands"]
[null,null,null,null,null,null,null,null,null,null,null,null,null,"Linguistic Demand",null,"Cultural Loading"]
[null,null,null,null,null,"Broad Abilities",null,"Narrow Abilities",null,null,null,"ss",null,null,null,null,null,null,null,{"$f":"F12","v":13}]
[null,null,null,"Verbal Comprehension"]
[null,null,null,"Similarities",null,"Gc",null,"Language Development",null,null,null,{"$f":"F116","v":11},null,"high",null,"high"]
[null,null,null,null,null,null,null,"Lexical Knowledge"]
[]
[null,null,null,"Vocabulary",null,"Gc",null,"Language Development",null,null,null,{"$f":"F117","v":11},null,"high",null,"high"]
[null,null,null,null,null,null,null,"Lexical Knowledge"]
[]
[null,null,null,"Comprehension",null,"Gc",null,"Language Development",null,null,null,{"$f":"F118","v":11},null,"high",null,"high"]
[null,null,null,null,null,null,null,"General Information"]
[]
[null,null,null,"Information",null,"Gc",null,"General Information",null,null,null,{"$f":"F119","v":10},null,"high",null,"high"]
[]
[null,null,null,"Word Reasoning",null,"Gc",null,"Lexical Knowledge",null,null,null,{"$f":"F120","v":10},null,"high",null,"high",null,null,null,null,null,null,null,null,null,null,null,null,{"$f":"IF(ABS(L206)>8,3,0)","v":3},null,{"$f":"SIGN(L206)","v":1}]
[null,null,null,null,null,null,null,"General Information",null,null,null,null,null,null,null,null,null,null,null,null,null,null,null,null,null,null,null,null,{"$f":"IF(ABS(L207)>10,3,0)","v":0},null,{"$f":"SIGN(L207)","v":0}]
[null,null,null,null,null,null,null,null,null,null,null,null,null,null,null,null,null,null,null,null,null,null,null,null,null,null,null,null,{"$f":"IF(ABS(L208)>10,3,0)","v":0},null,{"$f":"SIGN(L208)","v":0}]
[null,null,null,"Perceptual Reasoning"]
[null,null,null,"Block Design",null,"Gv",null,"Spatial Relations",null,null,null,{"$f":"F122","v":13},null,"moderate",null,"low",null,null,null,null,null,null,null,null,null,null,null,null,{"$f":"IF(ABS(M69)>9,3,0)","v":0},null,{"$f":"SIGN(M69)","v":0}]
[null,null,null,null,null,null,null,"Visualization",null,null,null,null,null,null,null,null,null,null,null,null,null,null,null,null,null,null,null,null,{"$f":"IF(ABS(M70)>10,3,0)","v":0},null,{"$f":"SIGN(M70)","v":0}]
[null,null,null,null,null,null,null,null,null,null,null,null,null,null,null,null,null,null,null,null,null,null,null,null,null,null,null,null,{"$f":"IF(ABS(M71)>10,3,0)","v":0},null,{"$f":"SIGN(M71)","v":0}]
[null,null,null,"Picture Concepts",null,"Gc",null,"General Information",null,null,null,{"$f":"F123","v":10},null,"moderate",null,"moderate",null,null,null,null,null,null,null,null,null,null,null,null,{"$f":"IF(ABS(L213)>8,3,0)","v":3},null,{"$f":"SIGN(L213)","v":1}]
[null,null,null,null,null,"Gf",null,"Induction"]
[null,null,null,null,null,null,null,null,null,null,null,null,null,null,null,null,null,null,null,null,null,null,null,null,null,null,null,null,{"$f":"IF(ABS(L215)>8,3,0)","v":0},null,{"$f":"SIGN(L215)","v":0}]
[null,null,null,"Matrix Reasoning",null,"Gf",null,"Induction",null,null,null,{"$f":"F124","v":10},null,"low",null,"low",null,null,null,null,null,null,null,null,null,null,null,null,{"$f":"IF(ABS(L216)>7,3,0)","v":3},null,{"$f":"SIGN(L216)","v":1}]
[null,null,null,null,null,null,null,null,null,null,null,null,null,null,null,null,null,null,null,null,null,null,null,null,null,null,null,null,{"$f":"IF(ABS(L217)>8,3,0)","v":0},null,{"$f":"SIGN(L217)","v":0}]
[null,null,null,"Picture Completion",null,"Gv",null,"Flexibility of Closure",null,null,null,{"$f":"F125","v":10},null,"low",null,"high"]
[null,null,null,null,null,"Gc",null,"General Information",null,null,null,null,null,null,null,null,null,null,null,null,null,null,null,null,null,null,null,null,{"$f":"IF(ABS(I219-I220)>10.5,3,0)","v":0},null,{"$f":"SIGN(L219)","v":0}]
[null,null,null,null,null,null,null,null,null,null,null,null,null,null,null,null,null,null,null,null,null,null,null,null,null,null,null,null,{"$f":"IF(ABS(I219-I220)>10.5,3,0)","v":0},null,{"$f":"SIGN(L220)","v":0}]
[null,null,null,"Working Memory"]
[null,null,null,"Digit Span",null,"Gsm",null,"Memory Span",null,null,null,{"$f":"F127","v":10},null,"moderate",null,"low",null,null,null,null,null,null,null,null,null,null,null,null,{"$f":"IF(ABS(J75-L76)>16.5,3,0)","v":0},null,{"$f":"SIGN(M75)","v":{"$error":"#VALUE!"}}]
[null,null,null,null,null,null,null,null,null,null,null,null,null,null,null,null,null,null,null,null,null,null,null,null,null,null,null,null,{"$f":"IF(ABS(J75-L76)>16.5,3,0)","v":0},null,{"$f":"SIGN(M76)","v":0}]
[null,null,null,"Letter-Number Sequence",null,"Gsm",null,"Working Memory",null,null,null,{"$f":"F128","v":10},null,"high",null,"low",null,null,null,null,null,null,null,null,null,null,null,null,{"$f":"IF(ABS(L77-I225)>16.5,3,0)","v":0},null,{"$f":"SIGN(M77)","v":{"$error":"#VALUE!"}}]
[null,null,null,null,null,null,null,null,null,null,null,null,null,null,null,null,null,null,null,null,null,null,null,null,null,null,null,null,{"$f":"IF(ABS(L77-I225)>16.5,3,0)","v":0},null,{"$f":"SIGN(L225)","v":0}]
[null,null,null,"Arithmetic",null,"Gq",null,"Math Achievement",null,null,null,{"$f":"F129","v":10},null,"moderate",null,"moderate",null,null,null,null,null,null,null,null,null,null,null,null,{"$f":"IF(ABS(I226-I227)>18,3,0)","v":0},null,1]
[null,null,null,null,null,"Gf",null,"Quantitative Reasoning",null,null,null,null,null,null,null,null,null,null,null,null,null,null,null,null,null,null,null,null,{"$f":"IF(ABS(I226-I227)>18,3,0)","v":0},null,0]
[null,null,null,null,null,null,null,null,null,null,null,null,null,null,null,null,null,null,null,null,null,null,null,null,null,null,null,null,{"$f":"IF(ABS(I228-I229)>16.5,3,0)","v":0},null,0]
[null,null,null,"Processing Speed",null,null,null,null,null,null,null,null,null,null,null,null,null,null,null,null,null,null,null,null,null,null,null,null,{"$f":"IF(ABS(I228-I229)>16.5,3,0)","v":0},null,0]
[null,null,null,"Coding",null,"Gs",null,"Rate of test taking",null,null,null,{"$f":"F131","v":6},null,"moderate",null,"low",null,null,null,null,null,null,null,null,null,null,null,null,{"$f":"IF(ABS(I230-I231)>18.5,3,0)","v":0},null,1]
[null,null,null,null,null,null,null,null,null,null,null,null,null,null,null,null,null,null,null,null,null,null,null,null,null,null,null,null,{"$f":"IF(ABS(I230-I231)>18.5,3,0)","v":0},null,0]
[null,null,null,"Symbols Search",null,"Gs",null,"Perceptual Speed",null,null,null,{"$f":"F132","v":10},null,"moderate",null,"low",null,null,null,null,null,null,null,null,null,null,null,null,{"$f":"IF(ABS(I232-#REF!)>16.5,3,0)","v":{"$error":"#REF!"}},null,1]
[null,null,null,null,null,null,null,"Rate of test taking",null,null,null,null,null,null,null,null,null,null,null,null,null,null,null,null,null,null,null,null,{"$f":"IF(ABS(I232-#REF!)>16.5,3,0)","v":{"$error":"#REF!"}},null,{"$f":"SIGN(M80)","v":{"$error":"#VALUE!"}}]
[]
[null,null,null,"Cancellation",null,"Gs",null,"Perceptual Speed",null,null,null,{"$f":"F133","v":10},null,"low",null,"low",null,null,null,null,null,null,null,null,null,null,null,null,{"$f":"IF(ABS(L82-J83)>15.5,3,0)","v":0},null,{"$f":"SIGN(M82)","v":{"$error":"#VALUE!"}}]
[null,null,null,null,null,null,null,null,null,null,null,null,null,null,null,null,null,null,null,null,null,null,null,null,null,null,null,null,{"$f":"IF(ABS(L82-J83)>15.5,3,0)","v":0},null,0]
[null,null,null,"Adapted from Appendix A, pp. 445 – 453, The Intelligence Test Desk Reference (ITDR): Gf-Gc Cross-Battery Assessment (McGrew & Flanagan, 1998) and Table 8.3, p. 312, The Wechsler Intelligence Scales and Gf-Gc Theory (Flanagan, McGrew & Ortiz, 2000)",null,null,null,null,null,null,null,null,null,null,null,null,null,null,null,null,null,null,null,null,null,null,null,null,{"$f":"IF(ABS(J84-J85)>12.5,3,0)","v":0},null,0]
[null,null,null,null,null,null,null,null,null,null,null,null,null,null,null,null,null,null,null,null,null,null,null,null,null,null,null,null,{"$f":"IF(ABS(J84-J85)>12.5,3,0)","v":0},null,0]
[null,null,null,null,null,null,null,null,null,null,null,null,null,null,null,null,null,null,null,null,null,null,null,null,null,null,null,null,{"$f":"IF(ABS(J86-J87)>16.5,3,0)","v":0},null,0]
[null,null,null,null,null,null,null,null,null,null,null,null,null,null,null,null,null,null,null,null,null,null,null,null,null,null,null,null,{"$f":"IF(ABS(J86-J87)>16.5,3,0)","v":0},null,0]
[null,null,null,null,null,null,null,null,null,null,null,null,null,null,null,null,null,null,null,null,null,null,null,null,null,null,null,null,{"$f":"IF(ABS(I241-I242)>15.5,3,0)","v":0},null,{"$f":"SIGN(L241)","v":0}]
[null,"12. Dumont-Willis Indexes",null,null,null,null,null,null,null,null,null,null,null,null,null,null,null,null,null,null,null,null,null,null,null,null,null,null,{"$f":"IF(ABS(I241-I242)>15.5,3,0)","v":0},null,0]
[null,null,null,null,null,null,null,null,null,null,null,null,null,null,null,null,null,null,null,null,null,null,null,null,null,null,null,null,{"$f":"IF(ABS(I243-I244)>15,3,0)","v":0},null,0]
[null,null,null,"DWI-1 (VCI + PRI) =",null,{"$f":"(1.092*V244)+34.47","v":70.506},null,null,null,null,null,null,null,null,null,null,null,null,null,null,{"$f":"IF(W21=3,W13)","v":false},{"$f":"U244+U245","v":33},null,null,null,null,null,null,{"$f":"IF(ABS(I243-I244)>15,3,0)","v":0},null,0]
[null,null,null,"DWI-2 (WMI + PSI) =",null,{"$f":"(1.715*V246)+31.4","v":93.14},null,null,null,null,null,null,null,null,null,null,null,null,null,null,{"$f":"IF(W20=3,Y13)","v":33},null,null,null,null,null,null,null,{"$f":"IF(ABS(I245-I246)>17.5,3,0)","v":0},null,0]
[null,null,null,null,null,null,null,null,null,null,null,null,null,null,null,null,null,null,null,null,{"$f":"IF(AB42<2,\"\",AA13)","v":20},{"$f":"U246+U247","v":36},null,null,null,null,null,null,{"$f":"IF(ABS(I245-I246)>17.5,3,0)","v":0},null,0]
[null,"Conceptually, the Dumont-Willis DWI-1 Index parallels the General Ability Index (GIA) developed by Prifitera, Weiss, and Saklofske and by Tulsky, Saklofske, Wilkins,  & Weiss for the sum of scaled scores for the VCI and POI subtests of the WISC-III and WAIS-III.  Unlike the DWI tables, the GIA tables are based directly on the WISC-III and WAIS-III normative data.  ",null,null,null,null,null,null,null,null,null,null,null,null,null,null,null,null,null,null,{"$f":"IF(AE42<2,\"\",AC13)","v":16}]
[]
[null,"Similarly, the Dumont-Willis DWI-2 Index is based on the sum of scaled scores for the Digit Span and Letter-Number Sequencing (WMI) and Coding and Symbol Search (PSI) subtests.  This score is very similar to Alan Kaufman's \"third factor\"and \"SCAD\" scores.  It should be computed and considered only when the four WMI and PSI subtest scores are close to one another and substantially separate from the VCI and PRI subtests.  In those cases, the DWI-1 and DWI-2 scores may be an efficient alternative means of summarizing the 10 WISC-IV core subtests, but they must never be confused with normative WISC-IV factor and IQ scores."]
[]
[]
[]
[null,null,null,"Oral / Verbal",null,null,null,"Pictures / Puzzles / Paper"]
[null,null,null,{"$f":"V257","v":9.9},null,null,null,null,{"$f":"V258","v":9.1}]
[null,null,null,"Similarities",null,{"$f":"F116","v":11},null,null,"Block Design",null,null,null,null,{"$f":"F122","v":13},null,"Higher Level Thinking     DWI-1",null,null,null,{"$f":"SUM(F255:F259)+SUM(N255:N259)","v":102},{"$f":"COUNT(F255:F259)+COUNT(N255:N259)","v":10},{"$f":"T255/U255","v":10.199999999999999}]
[null,null,null,"Vocabulary",null,{"$f":"F117","v":11},null,null,"Picture Concepts",null,null,null,null,{"$f":"F123","v":10},null,null,null,null,null,{"$f":"SUM(F263:F267)+SUM(N263:N267)","v":88},{"$f":"COUNT(F263:F267)+COUNT(N263:N267)","v":10},{"$f":"T256/U256","v":8.8000000000000007}]
[null,null,null,"Comprehension",null,{"$f":"F118","v":11},null,null,"Matrix Reasoning",null,null,null,null,{"$f":"F124","v":10},null,null,null,null,null,{"$f":"SUM(F255:F259)+SUM(F263:F267)","v":99},{"$f":"COUNT(F255:F259)+COUNT(F263:F267)","v":10},{"$f":"T257/U257","v":9.9}]
[null,null,null,"Information",null,{"$f":"F119","v":10},null,null,"Picture Completion",null,null,null,null,{"$f":"F125","v":10},null,{"$f":"V255","v":10.199999999999999},null,null,null,{"$f":"SUM(N255:N259)+SUM(N263:N267)","v":91},{"$f":"COUNT(N255:N259)+COUNT(N263:N267)","v":10},{"$f":"T258/U258","v":9.1}]
[null,null,null,"Word Reasoning",null,{"$f":"F120","v":10},null,null,"Block Design No Time Bonus",null,null,null,null,{"$f":"IF(F30=\"\",\"\",F30)","v":6}]
[]
[]
[]
[null,null,null,"Digit Span",null,{"$f":"F127","v":10},null,null,"Coding",null,null,null,null,{"$f":"F131","v":6},null,"Processing   DWI-2"]
[null,null,null,"Letter-Number Sequence",null,{"$f":"F128","v":10},null,null,"Symbol Search",null,null,null,null,{"$f":"F132","v":10}]
[null,null,null,"Arithmetic",null,{"$f":"F129","v":10},null,null,"Cancellation",null,null,null,null,{"$f":"F133","v":10}]
[null,null,null,"DS Forward",null,{"$f":"IF(F31=\"\",\"\",F31)","v":12},null,null,"CA Random",null,null,null,null,{"$f":"IF(F33=\"\",\"\",F33)","v":7},null,{"$f":"V256","v":8.8000000000000007}]
[null,null,null,"DS Backward",null,{"$f":"IF(F32=\"\",\"\",F32)","v":4},null,null,"CA Structured",null,null,null,null,{"$f":"IF(F34=\"\",\"\",F34)","v":9}]
[]
[]
[]
[]
[]
[null,"Block Design",{"$f":"F12","v":13}]
[null,"Similarities",11]
[null,"Digit Span",10]
[null,"Picture Concepts",10]
[null,"Coding",6]
[null,"Vocabulary",11]
[null,"Letter-Number Sequence",10]
[null,"Matrix Reasoning",10]
[null,"Comprehension",11]
[null,"Symbol Search",10]
[null,"Picture Completion",10]
[null,"Cancellation",10]
[null,"Information",10]
[null,"Arithmetic",10]
[null,"Word Reasoning",10]
[]
[]
[]
[]
[]
[]
[]
[]
[]
[]
[]
[]
[]
[]
[]
[]
[]
[]
[]
[]
[]
[]
[]
[]
[]
[]
[]
[]
[]
[]
[]
[]
[]
[]
[]
[]
[]
[]
[]
[]
[]
[]
[]
[]
[]
[]
[]
[]
[]
[]
[]
[]
[]
[]
[]
[]
[]
[]
[]
[]
[]
[]
[null,null,null,null,null,null,null,null,""]
[]
[null,null,null,null,null,null,null,null,null,null,null,null,null,null,null,null,null,null,null,null,null,null,null,null,null,null,null,null,null,null,null,null,null,null,null,null,null,null,null,null,null,null,null,null,null,null,null,null,"",""]
[null,null,null,null,null,null,null,null,null,null,null,null,null,null,null,null,null,null,null,null,null,null,null,null,null,null,null,null,null,null,null,null,null,null,null,null,null,null,null,null,null,null,null,null,null,null,null,null,{"$f":"$I$243","v":0},{"$f":"$I$244","v":0}]
[null,null,null,null,null,null,null,null,null,null,null,null,null,null,null,null,null,null,null,null,null,null,null,null,null,null,null,null,null,null,null,null,null,null,null,null,null,null,null,null,null,null,null,null,null,null,null,"","Aud. Mem.","Rep.",""]
[null,null,null,null,null,null,null,null,null,null,null,null,null,null,null,null,null,null,null,null,null,null,null,null,null,null,null,null,null,null,null,null,null,null,null,null,null,null,null,null,null,null,null,null,null,null,null,null,{"$f":"AVERAGE($AW$353:$AX$353)","v":0},{"$f":"AVERAGE($AW$353:$AX$353)","v":0}]
[]
[]
[]
["SS",40,62,68,71,73,75,77,78,79,80,81,82,83,84,85,86,87,88,89,90,91,92,93,94,95,96,97,98,99,100,101,102,103,104,105,106,107,108,109,110,111,112,113,114,115,116,117,118,119,120,121,122,123,124,126,129,131,133]
["%ile",1,1,2,3,4,5,6,7,8,9,10,12,13,14,16,18,19,21,23,25,27,30,32,34,37,39,42,45,47,50,53,55,58,61,63,66,68,70,73,75,77,79,81,82,84,86,87,88,90,91,92,93,94,95,96,97,98,99]
[]
[]
[null,null,"vp",1,12,13,14,15,16,17,18,19,20,21,22,23,24,25,26,27,28,31,34]
[null,null,"%",50,34,31,28,24,22,18,16,14,12,10,8,7,6,5,4,3,2,1,0.5]
[null,null,"SS",1,2,3,4,5,6,7,8,9,10,11,12,13,14,15,16,17,18,19]
[null,null,"%",0.1,0.4,1,2,5,9,16,25,37,50,63,75,84,91,95,98,99,99.599999999999,99.9]
[]
[]
[null,null,"%",1,1,1,1,1,1,1,1,1,1,1,1,1,1,1,1,1,1,2,2,2,2,4,4,5,6,7,8,9,10,12,12,16,18,19,21,25,27,30,34,37,40,42,45,50,53,55,58,63,66,68,70,73,77,79,81,82,84,87,66,90,91,93,94,95,96,97,97,98,98,99,99,99,99,99,99,99,99,99,99,99,99,99,99,99,99,99,99,99]
[null,null,"Pss",9,10,11,12,13,14,15,16,17,18,19,20,21,22,23,24,25,26,27,28,29,30,31,32,33,34,35,36,37,38,39,40,41,42,43,44,45,46,47,48,49,50,51,52,53,54,55,56,57,58,59,60,61,62,63,64,65,66,67,68,69,70,71,72,73,74,75,76,77,78,79,80,81,82,83,84,85,86,87,88,89,90]
[null,null,"PRI",45,46,48,49,51,52,54,55,57,58,60,61,63,64,65,67,68,69,70,71,72,73,74,75,77,78,80,81,82,84,85,86,87,88,90,91,92,93,95,96,98,100,101,102,104,105,106,108,109,111,112,114,115,117,118,120,121,123,124,126,128,129,130,131,132,133,135,136,138,139,141,142,143,145,146,147,149,150,151,152,154,155]
[null,null,"%",1,1,1,1,1,1,1,1,1,1,1,1,1,1,1,1,2,2,2,3,3,4,5,5,6,7,9,10,12,14,16,18,19,21,25,27,30,32,36,40,45,50,53,55,61,63,66,70,73,77,79,82,84,87,88,91,92,94,95,96,97,97,98,98,98,99,99,99,99,99,99,99,99,99,99,99,99,99,99,99,99,99]
[null,null,"Fss",15,16,18,19,20,22,23,24,26,27,28,30,31,33,34,35,37,38,39,40,42,43,44,45,46,48,49,50,51,53,55,57,59,61,62,64,65,67,68,70,71,73,75,76,77,79,81,82,84,85,87,88,90,92,93,94,95,97,98,99,100,102,104,106,107,108,110,111,112,113,115,116,117,119,120,121,122,123,124,126,127,128,130,131,133,134,135,137,138,140,141,142,143,144,146,147,148,149,150,151,153,154,156,158,159,161,163,164,166,167,168,170,171,173,174,176,177,179,181,182,184]
[null,null,"FIQ",40,41,42,43,44,45,46,47,48,49,50,51,52,53,54,55,56,57,58,59,60,61,62,63,64,65,66,67,68,69,70,71,72,73,74,75,76,77,78,79,80,81,82,83,84,85,86,87,88,89,90,91,92,93,94,95,96,97,98,99,100,101,102,103,104,105,106,107,108,109,110,111,112,113,114,115,116,117,118,119,120,121,122,123,124,125,126,127,128,129,130,131,132,133,134,135,136,137,138,139,140,141,142,143,144,145,146,146,147,149,150,151,152,153,154,155,156,157,158,159,160]
[null,null,"%",1,1,1,1,1,1,1,1,1,1,1,1,1,1,1,1,1,1,1,1,1,1,1,1,1,1,1,1,2,2,2,3,3,4,4,5,5,6,7,8,9,10,12,13,14,16,18,19,21,23,25,27,30,32,34,37,40,42,45,47,50,53,55,58,61,63,66,68,70,73,75,77,79,81,82,84,86,87,88,90,91,92,93,94,95,95,96,96,97,97,98,98,98,99,99,99,99,99,99,99,99,99,99,99,99,99,99,99,99,99,99,99,99,99,99,99,99,99,99,99,99]
[null,null,null,0,70,80,90,111,120,130]
[null,null,null,"ExtLow","BL","LA","AVE","HAVE","SUP","VSUP"]
[null,null,"Scatter",0,1,2,3,4,5,6,7,8,9,10,11,12,13,14,15,16,17,18,19,20,21,22,23,24,25,26,27,28,29,30,31,32,33,34,35,36,37,38,39,40]
[null,null,"v6 scat%",100,100,98.4,90.3,72.8,50.4,31.3,17.2,7.9,3.7,1.8,0.6,0.2,0,0,0,0,0,0]
[null,null,"v7 scat%",100,100,99.3,95,82.4,61.7,41.4,24.4,11.5,5.0999999999999996,1.8,0.9,0.3,0.2,0.2,0,0,0,0]
[null,null,"p5 Scat%",100,99.9,98.4,90,74.900000000000006,56.5,37.5,23,12.3,5.4,2.2999999999999998,1.1000000000000001,0.4,6,5,3.6,2.6,1.3,0.7]
[null,null,"p7 Scat%",100,100,99.7,96.8,87.3,70.099999999999994,50.7,32.4,18.2,8.9,4.2,1.9,0.8,0.3,0.2,0.2,0,0,0]
[null,null,"IQ 11 scat Scat%",100,100,99.9,99.6,96.7,87.2,71.2,50.9,32.200000000000003,17.399999999999999,8.1,3.1,1.2,0.3,0.1,0,0,0,0,0]
[null,null,"IQ 13 scat Scat%",100,100,100,99.8,98.5,92.3,79,58,37.700000000000003,21.5,10.199999999999999,4.2,1.9,0.8,0.4,0.3,0.2,0.1,0,0]
[null,null,"IQ 14 scat Scat%",100,100,100,100,99,94.6,82.2,63.8,42.5,23.9,11.5,5,2.4,0.8,0.4,0.3,0.2,0.1,0.1,0]
[]
[null,null,"vp diff",100,97,88,81,73,66,60,54,48,43,37,32,28,24,20,19,16,13,11,9,7,6,5,4,3,3,2,2,1,1,1,1,1,1,0.4,0.3,0.3,0.3,0.2,0.2,0.1]
[null,null,"p7 Scat%",100,100,99.7,96.8,87.3,70.099999999999994,50.7,32.4,18.2,8.9,4.2,1.9,0.8,0.3,0.2,0.2,0,0,0]
[null,null,"p7 Scat%",100,100,99.7,96.8,87.3,70.099999999999994,50.7,32.4,18.2,8.9,4.2,1.9,0.8,0.3,0.2,0.2,0,0,0]
[]
[null,null,"Pairs",1,2,5,10,25,50,null,null,null,null,"free rc",1,2,5,10,25,50,null,null,null,null,"copy",1,2,5,10,25,50]
[null,null,16,0,4,7,9,13,15,null,{"$f":"IF($O$12=\"\",\"\",LOOKUP($O$12,D392:I392,$D$391:$I$391))","v":""},{"$f":"LOOKUP(N6,C392:C404,K392:K404)","v":{"$error":"#N/A"}},null,16,0,5,6,6,7,8,null,{"$f":"IF($O$13=\"\",\"\",LOOKUP($O$13,O392:T392,$D$391:$I$391))","v":""},{"$f":"LOOKUP(N6,N392:N404,V392:V404)","v":{"$error":"#N/A"}},null,16,0,63,81,92,109,124,null,{"$f":"IF($O$14=\"\",\"\",LOOKUP($O$14,Z392:AE392,$D$391:$I$391))","v":""},{"$f":"LOOKUP(N6,Y392:Y404,AG392:AG404)","v":{"$error":"#N/A"}}]
[null,null,18,0,4,6,9,12,15,null,"",null,null,18,0,4,5,6,7,8,null,"",null,null,18,0,49,77,102,116,131,null,""]
[null,null,20,0,2,5,7,11,14,null,"",null,null,20,0,4,5,6,7,8,null,"",null,null,20,0,60,82,93,110,130,null,""]
[null,null,25,0,5,6,9,11,14,null,"",null,null,25,0,5,5,6,7,8,null,"",null,null,25,0,77,84,92,111,129,null,""]
[null,null,30,0,4,7,8,10,14,null,"",null,null,30,0,5,5,6,7,8,null,"",null,null,30,0,66,82,93,108,123,null,""]
[null,null,35,0,4,5,6,10,13,null,"",null,null,35,0,5,5,6,6,7,null,"",null,null,35,0,53,75,90,106,124,null,""]
[null,null,45,0,2,4,6,9,12,null,"",null,null,45,0,4,5,5,6,7,null,"",null,null,45,0,43,73,82,99,114,null,""]
[null,null,55,0,2,3,4,8,10,null,"",null,null,55,0,3,4,5,6,7,null,"",null,null,55,0,27,53,65,83,102,null,""]
[null,null,65,0,2,3,4,6,8,null,"",null,null,65,0,2,4,5,6,7,null,"",null,null,65,0,19,39,59,73,93,null,""]
[null,null,70,0,1,3,4,6,8,null,"",null,null,70,0,2,4,5,6,7,null,"",null,null,70,0,45,53,60,74,90,null,""]
[null,null,75,0,2,3,4,6,9,null,"",null,null,75,0,2,4,4,5,6,null,"",null,null,75,0,35,49,55,68,83,null,""]
[null,null,80,0,0,1,2,5,8,null,"",null,null,80,0,2,3,4,5,6,null,"",null,null,80,0,23,32,45,59,77,null,""]
[null,null,85,0,0,1,2,4,8,null,"",null,null,85,0,1,3,4,5,6,null,"",null,null,85,0,20,25,37,45,62,null,""]
[]
[]
[]
[]
[]
[]
[]
[]
[]
[]
[]
[]
[]
[]
[]
[]
[]
[]
[]
[]
[]
[]
[]
[]
[]
[]
[]
[]
[null,null,null,1,70,80,90,110,120,130]
[null,null,null,"Extremely Low","Borderline","Low Average","Average","High Average","Superior","Very Superior"]
[null,null,"vsc",46,55,67,75,86,95,106,116,127,135,147,155]
[null,null,"vconf-",-4,-4,-5,-5,-6,-6,-7,-7,-8,-8,-9,-9]
[null,null,"vconf+",9,8,8,7,7,6,6,5,5,4,4,3]
[null,null,"psc",45,47,55,63,72,79,88,96,105,114,123,129,140,146,155]
[null,null,"pconf-",-3,-4,-4,-5,-5,-6,-6,-7,-7,-8,-8,-9,-9,-9,-9]
[null,null,"pconf+",10,10,9,9,8,8,7,7,6,6,5,5,4,4,3]
[null,null,"fssc",40,48,53,82,86,112,115,119,148,153]
[null,null,"fsconf-",-3,-3,-4,-4,-5,-5,-5,-6,-6,-7]
[null,null,"fsconf+",7,6,6,5,5,5,4,4,3,3]
[null,null,"psi",46,49,56,60,64,68,73,75,83,85,91,94,100,102,110,113,119,122,128,131,137,140,145,150]
[null,null,"psi",-3,-3,-4,-4,-5,-5,-6,-6,-7,-7,-8,-8,-9,-9,-10,-10,-11,-11,-12,-12,-13,-13,-14,-14]
[null,null,"psi",15,14,14,13,13,12,13,11,11,10,10,9,9,8,8,7,7,6,6,5,5,4,4,3]
[null,null,"GLC",45,50,54,63,67,75,78,86,91,100,103,113,116,125,128,138,141,147,152]
[null,null,"GLC",-3,-4,-4,-5,-5,-6,-6,-7,-7,-8,-8,-9,-9,-10,-10,-11,-11,-12,-12]
[null,null,"GLC",12,12,11,11,10,10,9,9,8,8,7,7,6,6,5,5,4,4,3]
[null,null,"wmi",50,55,63,73,80,88,97,106,113,124,130,139,147]
[null,null,"wmi-",-4,-4,-5,-5,-6,-6,-7,-7,-8,-8,-9,-9,-10]
[null,null,"wmi+",10,9,9,8,8,7,7,6,6,5,5,4,4]
[null,null,"pssc",54,57,63,71,73,79,81,88,96,99,106,114,122,131,140,148]
[null,null,"psconf-",-3,-4,-5,-5,-6,-6,-7,-8,-8,-9,-10,-11,-12,-13,-14,-15]
[null,null,"psconf+",14,14,13,12,12,11,11,10,9,9,8,7,6,5,4,3]
[]
[null,null,"Vss",3,{"$f":"D457+1","v":4},{"$f":"E457+1","v":5},6,7,8,9,10,11,12,13,14,15,16,17,18,19,20,21,22,23,24,25,26,27,28,29,30,31,32,33,34,35,36,37,38,39,40,41,42,43,44,45,46,47,48,49,50,51,52,53,54,55,{"$f":"BD457+1","v":56},57]
[null,null,"VCI",45,47,50,53,55,57,59,61,63,65,67,69,71,73,75,77,79,81,83,85,87,89,91,93,95,96,98,99,100,102,104,106,108,110,112,114,116,119,121,124,126,128,130,132,134,136,138,140,142,144,146,148,150,152,155]
[null,null,"Pss",3,{"$f":"D459+1","v":4},{"$f":"E459+1","v":5},6,7,8,9,10,11,12,13,14,15,16,17,18,19,20,21,22,23,24,25,26,27,28,29,30,31,32,33,34,35,36,37,38,39,40,41,42,43,44,45,46,47,48,49,50,51,52,53,54,55,56,57]
[null,null,"PRI",45,47,49,51,53,55,57,59,61,63,65,67,69,71,73,75,77,79,82,84,86,88,90,92,94,96,98,100,102,104,106,108,110,112,115,117,119,121,123,125,127,129,131,133,135,137,139,141,143,145,147,149,151,153,155]
[null,null,"wmi",2,{"$f":"D461+1","v":3},{"$f":"E461+1","v":4},5,6,7,8,9,10,11,12,13,14,15,16,17,18,19,20,21,22,{"$f":"X461+1","v":23},24,25,26,27,28,29,30,31,32,33,34,35,36,37,38]
[null,null,"wmiss",50,52,54,56,59,62,65,68,71,74,77,80,83,86,88,91,94,97,99,102,104,107,110,113,116,120,123,126,129,132,135,138,141,144,146,148,150]
[null,null,"psi",2,3,4,5,6,7,8,9,10,11,12,13,14,15,16,17,18,19,20,21,22,23,24,25,26,27,28,29,30,31,32,33,34,35,36,37,38]
[null,null,"psiss",50,53,56,59,62,65,68,70,73,75,78,80,83,85,88,91,94,97,100,103,106,109,112,115,118,121,123,126,128,131,133,136,138,141,144,147,150]
[null,null,"FSss",7,{"$f":"D465+1","v":8},{"$f":"E465+1","v":9},10,11,12,13,14,15,16,17,18,19,20,21,22,23,24,25,26,27,28,29,30,31,32,33,34,35,36,37,38,39,40,41,42,43,44,45,46,47,48,49,50,51,52,53,54,55,56,57,58,59,60,61,62,63,64,65,66,67,68,69,70,71,72,{"$f":"BQ465+1","v":73},74,75,76,77,78,79,80,81,82,83,84,85,{"$f":"CD465+1","v":86},{"$f":"CE465+1","v":87},{"$f":"CF465+1","v":88},89,90,91,92,93,94,95,96,97,98,99,100,101,102,103,104,105,106,107,108,109,110,111,112,113,114,115,116,117,118,119,120,121,122,123,124,125,126,127,128,129,130,131,132,133,134,135,136,137,138,139,140,141,142,143,144,145,146,147,148,149,150,151,{"$f":"ER465+1","v":152},153,154,155,156,157,158,159,160,161,162,163,164,165,166,167,168,169,170,171,172,173,174,175,176,177,178,179,180,181,182,183,184,185,186,187,188,189,190]
[null,null,"FIQ",40,41,42,40,40,40,40,40,41,41,42,42,43,44,44,45,46,46,47,48,48,49,50,50,51,52,52,53,54,54,55,56,56,57,58,58,59,60,60,61,62,62,63,64,65,66,67,68,68,69,70,70,71,71,72,72,73,73,74,75,75,76,77,78,78,79,80,81,81,82,83,84,84,85,86,87,87,88,88,89,89,90,91,92,92,93,94,95,96,97,98,99,99,100,101,102,102,103,104,105,105,106,107,108,108,109,109,110,111,112,113,114,114,115,116,117,118,119,119,120,120,121,122,123,123,124,125,126,126,127,128,129,130,130,131,132,132,133,134,135,135,136,137,138,138,139,140,141,141,142,143,144,144,145,146,147,147,148,149,149,150,150,151,151,152,152,153,153,154,154,155,155,156,156,157,157,158,158,159,159,160,160,160,160]

{"sheet":"Shares Abilities","index":2,"n_rows":59,"n_cols":17,"rows_kept":59,"cut":false,"hidden":false,"merged":[]}
[]
["      The following uses separate Verbal and Perceptual values unless you specify the Full Scale by typing \"F\" here:"]
[]
[null,null,"S","V","C","I","WR","BD","PCn","MR","PCmp","Ds","Ln","A","Cd","SS","Can"]
[null,"Deviation from mean:",{"$f":"IF(O2=\"F\",'WISC IV'!P116,'WISC IV'!K116)","v":0.40000000000000036},{"$f":"IF(O2=\"F\",'WISC IV'!P117,'WISC IV'!K117)","v":0.40000000000000036},{"$f":"IF(O2=\"F\",'WISC IV'!P118,'WISC IV'!K118)","v":0.40000000000000036},{"$f":"IF(O2=\"F\",'WISC IV'!P119,'WISC IV'!K119)","v":-0.59999999999999964},{"$f":"IF(P2=\"F\",'WISC IV'!P120,'WISC IV'!K120)","v":-0.59999999999999964},{"$f":"IF(O2=\"F\",'WISC IV'!P122,'WISC IV'!K122)","v":2.25},{"$f":"IF(O2=\"F\",'WISC IV'!P123,'WISC IV'!K123)","v":-0.75},{"$f":"IF(O2=\"F\",'WISC IV'!P124,'WISC IV'!K124)","v":-0.75},{"$f":"IF(O2=\"F\",'WISC IV'!P125,'WISC IV'!K125)","v":-0.75},{"$f":"'WISC IV'!P127","v":-0.13333333333333286},{"$f":"'WISC IV'!P128","v":-0.13333333333333286},{"$f":"'WISC IV'!P129","v":-0.13333333333333286},{"$f":"'WISC IV'!P131","v":-4.1333333333333329},{"$f":"'WISC IV'!P132","v":-0.13333333333333286},{"$f":"'WISC IV'!P133","v":-0.13333333333333286}]
[null,"Strength or Weakness:",{"$f":"IF(O2=\"F\",'WISC IV'!Q116,'WISC IV'!L116)","v":""},{"$f":"IF(O2=\"F\",'WISC IV'!Q117,'WISC IV'!L117)","v":""},{"$f":"IF(O2=\"F\",'WISC IV'!Q118,'WISC IV'!L118)","v":""},{"$f":"IF(O2=\"F\",'WISC IV'!Q119,'WISC IV'!L119)","v":""},{"$f":"IF(P2=\"F\",'WISC IV'!Q120,'WISC IV'!L120)","v":""},{"$f":"IF(O2=\"F\",'WISC IV'!Q122,'WISC IV'!L122)","v":"s"},{"$f":"IF(O2=\"F\",'WISC IV'!Q123,'WISC IV'!L123)","v":""},{"$f":"IF(O2=\"F\",'WISC IV'!Q124,'WISC IV'!L124)","v":""},{"$f":"IF(O2=\"F\",'WISC IV'!Q125,'WISC IV'!L125)","v":""},{"$f":"'WISC IV'!Q127","v":""},{"$f":"'WISC IV'!Q128","v":""},{"$f":"'WISC IV'!Q129","v":""},{"$f":"'WISC IV'!Q131","v":"w"},{"$f":"'WISC IV'!Q132","v":""},{"$f":"'WISC IV'!Q133","v":""}]
[null,"Positive or Negative:",{"$f":"IF(C5=\"\",\"\",IF(SIGN(C5)=1,\"+\",IF(SIGN(C5)=-1,\"-\",\"\")))","v":"+"},"+","+","-","-","+","-","-","-","-","-","-","-","-","-"]
["INPUT"]
["Attention-Concentration",null,null,null,null,null,null,null,null,null,{"$f":"IF(K6=\"\",K7,K6)","v":"-"},"-","-","-","w","-","-"]
["Auditory-Vocal Channel",null,{"$f":"IF(C6=\"\",C7,C6)","v":"+"},{"$f":"IF(D6=\"\",D7,D6)","v":"+"},{"$f":"IF(E6=\"\",E7,E6)","v":"+"},{"$f":"IF(F6=\"\",F7,F6)","v":"-"},{"$f":"IF(G6=\"\",G7,G6)","v":"-"},null,null,null,null,{"$f":"L9","v":"-"},{"$f":"M9","v":"-"},{"$f":"N9","v":"-"}]
["Complex Verbal Directions",null,null,null,null,null,null,{"$f":"IF(H6=\"\",H7,H6)","v":"s"},null,{"$f":"IF(J6=\"\",J7,J6)","v":"-"},null,null,null,null,{"$f":"O9","v":"w"},{"$f":"P9","v":"-"},{"$f":"Q9","v":"-"}]
["Essential from Non Essential",null,{"$f":"C10","v":"+"},null,null,null,null,null,null,{"$f":"J11","v":"-"},{"$f":"K9","v":"-"},null,null,null,null,{"$f":"P11","v":"-"},{"$f":"Q11","v":"-"}]
["Encoding Information for Processing",null,null,null,null,null,{"$f":"G10","v":"-"},null,null,null,null,{"$f":"L10","v":"-"},{"$f":"M10","v":"-"},{"$f":"N10","v":"-"},{"$f":"O11","v":"w"},{"$f":"P12","v":"-"},{"$f":"Q11","v":"-"}]
["Understanding Long Questions",null,null,null,{"$f":"E10","v":"+"},{"$f":"IF(F6=\"\",F7,F6)","v":"-"},{"$f":"G13","v":"-"},null,null,null,null,null,null,{"$f":"N13","v":"-"}]
["Understanding Words",null,{"$f":"C12","v":"+"},{"$f":"IF(D6=\"\",D7,D6)","v":"+"},null,null,{"$f":"G14","v":"-"},null,null,null,null,{"$f":"L13","v":"-"},{"$f":"M13","v":"-"}]
["Visual Motor Channel",null,null,null,null,null,null,{"$f":"H11","v":"s"},{"$f":"IF(I6=\"\",I7,I6)","v":"-"},{"$f":"J12","v":"-"},{"$f":"K12","v":"-"},null,null,null,{"$f":"O13","v":"w"},{"$f":"P13","v":"-"},{"$f":"Q13","v":"-"}]
["Visual Perception-Abstr. Stim.",null,null,null,null,null,null,{"$f":"H16","v":"s"},null,{"$f":"J16","v":"-"},null,null,null,null,{"$f":"O16","v":"w"},{"$f":"P16","v":"-"},{"$f":"Q16","v":"-"}]
["Visual Perception-Cmpl. Mean. Stim.",null,null,null,null,null,null,null,{"$f":"I16","v":"-"},null,{"$f":"K16","v":"-"}]
["Visual Perception-Mean. Stim.",null,null,null,null,null,null,null,{"$f":"I18","v":"-"},null,{"$f":"K18","v":"-"},null,null,null,null,null,{"$f":"Q17","v":"-"}]
["INTEGRATION/STORAGE"]
["Achievement",null,{"$f":"C15","v":"+"},{"$f":"D15","v":"+"},{"$f":"E14","v":"+"},{"$f":"F14","v":"-"},{"$f":"G15","v":"-"},null,null,null,null,null,null,{"$f":"N14","v":"-"}]
["Acquired Knowledge",null,null,{"$f":"D21","v":"+"},null,{"$f":"F21","v":"-"},{"$f":"G21","v":"-"},null,null,null,null,null,null,{"$f":"N21","v":"-"}]
["Concept Formation",null,{"$f":"C21","v":"+"},{"$f":"D22","v":"+"},null,null,{"$f":"G22","v":"-"},{"$f":"H17","v":"s"}]
["Crystallized Intelligence",null,{"$f":"C23","v":"+"},{"$f":"D23","v":"+"},{"$f":"E21","v":"+"},{"$f":"F22","v":"-"},{"$f":"G23","v":"-"},null,{"$f":"I19","v":"-"}]
["Culture Loaded Knowledge",null,null,null,{"$f":"E24","v":"+"},{"$f":"F24","v":"-"}]
["Evaluation",null,null,null,{"$f":"E25","v":"+"},null,{"$f":"G24","v":"-"},{"$f":"H23","v":"s"},{"$f":"I24","v":"-"},{"$f":"J17","v":"-"},{"$f":"K19","v":"-"},null,null,null,{"$f":"O17","v":"w"},{"$f":"P17","v":"-"},{"$f":"Q19","v":"-"}]
["Facility with Numbers",null,null,null,null,null,null,null,null,null,null,{"$f":"L15","v":"-"},{"$f":"M15","v":"-"},{"$f":"N22","v":"-"},{"$f":"O26","v":"w"}]
["Figural Cognition",null,null,null,null,null,null,{"$f":"H26","v":"s"},null,{"$f":"J26","v":"-"},{"$f":"K26","v":"-"},null,null,null,null,null,{"$f":"Q26","v":"-"}]
["Figural Evaluation",null,null,null,null,null,null,{"$f":"H28","v":"s"},null,{"$f":"J28","v":"-"},{"$f":"K28","v":"-"},null,null,null,null,{"$f":"P26","v":"-"},{"$f":"Q28","v":"-"}]
["Fluid Intelligence",null,{"$f":"C24","v":"+"},null,null,null,{"$f":"G26","v":"-"},{"$f":"H29","v":"s"},{"$f":"I26","v":"-"},{"$f":"J29","v":"-"},null,null,null,{"$f":"N27","v":"-"}]
["Fund of Information",null,null,{"$f":"D24","v":"+"},null,{"$f":"F25","v":"-"}]
["Long-term Memory",null,null,{"$f":"D31","v":"+"},null,{"$f":"F31","v":"-"},null,null,null,null,null,null,null,{"$f":"N30","v":"-"}]
["Memory",null,null,null,null,{"$f":"F32","v":"-"},null,null,null,null,null,{"$f":"L15","v":"-"},{"$f":"M27","v":"-"},{"$f":"N32","v":"-"}]
["Nonverbal Reasoning",null,null,null,null,null,null,null,{"$f":"I30","v":"-"},{"$f":"J30","v":"-"}]
["Planning Ability",null,null,null,null,null,null,null,null,null,null,null,null,null,null,{"$f":"P29","v":"-"},{"$f":"Q29","v":"-"}]
["Reasoning",null,{"$f":"C30","v":"+"},{"$f":"D32","v":"+"},null,null,null,null,{"$f":"I34","v":"-"},{"$f":"J34","v":"-"},null,null,null,{"$f":"N33","v":"-"}]
["Semantic Content",null,{"$f":"C36","v":"+"},{"$f":"D36","v":"+"},{"$f":"E26","v":"+"},{"$f":"F33","v":"-"},{"$f":"G30","v":"-"},null,{"$f":"I36","v":"-"},null,null,null,null,{"$f":"N36","v":"-"}]
["Sequencing",null,null,null,null,null,null,null,null,null,null,{"$f":"L33","v":"-"},{"$f":"M33","v":"-"},{"$f":"N37","v":"-"},{"$f":"O27","v":"w"}]
["Verbal Conceptualization",null,{"$f":"C37","v":"+"},{"$f":"D37","v":"+"},{"$f":"E37","v":"+"},null,{"$f":"G37","v":"-"}]
["Verbal Reasoning",null,{"$f":"C37","v":"+"},null,{"$f":"E39","v":"+"},null,{"$f":"G39","v":"-"}]
["Visual Memory",null,null,null,null,null,null,null,null,null,{"$f":"K29","v":"-"},null,null,null,{"$f":"O38","v":"w"}]
["Visual Processing",null,null,null,null,null,null,{"$f":"H30","v":"s"},{"$f":"I37","v":"-"},{"$f":"J36","v":"-"},{"$f":"K41","v":"-"},null,null,null,null,null,{"$f":"Q29","v":"-"}]
["Visual Sequencing",null,null,null,null,null,null,null,{"$f":"I37","v":"-"},null,null,null,null,null,{"$f":"O41","v":"w"},null,{"$f":"Q42","v":"-"}]
["OUTPUT"]
["Much Verbal Expression",null,{"$f":"C40","v":"+"},{"$f":"D39","v":"+"},{"$f":"E40","v":"+"}]
["Simple Verbal expression",null,null,null,null,{"$f":"F37","v":"-"},{"$f":"G40","v":"-"},null,null,null,null,{"$f":"L38","v":"-"},{"$f":"M38","v":"-"},{"$f":"N38","v":"-"}]
["Visual Organization",null,null,null,null,null,null,null,{"$f":"I43","v":"-"},{"$f":"J42","v":"-"},{"$f":"K42","v":"-"}]
["Visual-Motor Coordination",null,null,null,null,null,null,{"$f":"H42","v":"s"},null,null,null,null,null,null,{"$f":"O43","v":"w"},{"$f":"P35","v":"-"},{"$f":"Q43","v":"-"}]
["INFLUENCES"]
["Ability to Respond When Uncertain",null,null,null,null,null,null,null,null,{"$f":"J47","v":"-"},{"$f":"K47","v":"-"}]
["Alertness to environment",null,null,null,null,{"$f":"F46","v":"-"},null,null,null,null,{"$f":"K50","v":"-"}]
["Anxiety",null,null,null,null,null,null,null,null,null,null,{"$f":"L46","v":"-"},{"$f":"M46","v":"-"},{"$f":"N46","v":"-"},{"$f":"O48","v":"w"},{"$f":"P48","v":"-"},{"$f":"Q48","v":"-"}]
["Attention span",null,null,null,null,null,null,null,null,null,null,{"$f":"L52","v":"-"},{"$f":"M46","v":"-"},{"$f":"N46","v":"-"},null,{"$f":"P52","v":"-"},{"$f":"Q52","v":"-"}]
["Field in/dependence",null,null,null,null,null,null,{"$f":"H48","v":"s"},null,{"$f":"J50","v":"-"},{"$f":"K51","v":"-"}]
["Concentration",null,null,null,null,null,null,null,null,null,{"$f":"K54","v":"-"},null,{"$f":"M53","v":"-"},{"$f":"N53","v":"-"},{"$f":"O52","v":"w"},{"$f":"P53","v":"-"},{"$f":"Q53","v":"-"}]
["Distractibility",null,null,null,null,null,null,null,null,null,null,{"$f":"L53","v":"-"},{"$f":"M55","v":"-"},{"$f":"N55","v":"-"},{"$f":"O55","v":"w"},{"$f":"P55","v":"-"},{"$f":"Q55","v":"-"}]
["Motivation Level",null,null,null,null,null,null,null,null,null,null,null,null,null,{"$f":"O56","v":"w"},{"$f":"P56","v":"-"},{"$f":"Q56","v":"-"}]
["Negativism",null,{"$f":"C45","v":"+"},null,{"$f":"E45","v":"+"},null,null,null,null,null,{"$f":"K55","v":"-"},{"$f":"L56","v":"-"},{"$f":"M56","v":"-"}]
["Working Under Time Pressures",null,null,null,null,null,null,{"$f":"H54","v":"s"},null,null,{"$f":"K58","v":"-"},null,null,{"$f":"N56","v":"-"},{"$f":"O57","v":"w"},{"$f":"P57","v":"-"},{"$f":"Q57","v":"-"}]

{"sheet":"Cult. & Linq.","index":4,"n_rows":36,"n_cols":14,"rows_kept":36,"cut":false,"hidden":false,"merged":[[1,4,1,9],[26,2,27,11],[44,2,46,9],[2,4,2,5],[2,6,2,7],[2,8,2,9],[3,2,21,2],[3,3,9,3],[10,3,15,3],[17,3,21,3],[22,8,22,9],[18,4,19,4],[18,5,19,5],[22,4,22,5],[22,6,22,7]]}
[]
[null,null,null,null,"Degree of Linguistic Demands"]
[null,null,null,null,"High",null,"Moderate",null,"Low"]
[null,null,"Level Cultural Loading","Hign",null,null,null,null,null,null,null,null,{"$f":"IF(J7=\"\",0,J7)","v":10},{"$f":"IF(J7=\"\",\"\",1)","v":1}]
[null,null,null,null,"Similarities",{"$f":"IF('WISC IV'!F116=\"\",\"\",'WISC IV'!F116)","v":11},null,null,null,null,"High Cultural",null,{"$f":"IF(F5=\"\",0,F5)","v":11},{"$f":"IF(F5=\"\",\"\",1)","v":1}]
[null,null,null,null,"Vocabulary",{"$f":"IF('WISC IV'!F117=\"\",\"\",'WISC IV'!F117)","v":11},null,null,null,null,"Average:",{"$f":"M10/N10","v":10.5},{"$f":"IF(F6=\"\",0,F6)","v":11},{"$f":"IF(F6=\"\",\"\",1)","v":1}]
[null,null,null,null,"Comprehension",{"$f":"IF('WISC IV'!F118=\"\",\"\",'WISC IV'!F118)","v":11},null,null,"Picture Completion",{"$f":"IF('WISC IV'!F125=\"\",\"\",'WISC IV'!F125)","v":10},"Standard Score:",{"$f":"15*(L6-10)/3+100","v":102.5},{"$f":"IF(F7=\"\",0,F7)","v":11},{"$f":"IF(F7=\"\",\"\",1)","v":1}]
[null,null,null,null,"Information",{"$f":"IF('WISC IV'!F119=\"\",\"\",'WISC IV'!F119)","v":10},null,null,null,null,null,null,{"$f":"IF(F8=\"\",0,F8)","v":10},{"$f":"IF(F8=\"\",\"\",1)","v":1}]
[null,null,null,null,"Word Reasoning",{"$f":"IF('WISC IV'!F120=\"\",\"\",'WISC IV'!F120)","v":10},null,null,null,null,null,null,{"$f":"IF(F9=\"\",0,F9)","v":10},{"$f":"IF(F9=\"\",\"\",1)","v":1}]
[null,null,null,null,null,null,null,null,null,null,null,null,{"$f":"SUM(M4:M9)","v":63},{"$f":"SUM(N4:N9)","v":6}]
[null,null,null,"Moderate"]
[null,null,null,null,null,null,null,null,null,null,"Moderate Cultural",null,{"$f":"IF(H13=\"\",0,H13)","v":10},{"$f":"IF(H13=\"\",\"\",1)","v":1}]
[null,null,null,null,null,null,"Picture Concepts",{"$f":"IF('WISC IV'!F123=\"\",\"\",'WISC IV'!F123)","v":10},null,null,"Average:",{"$f":"M15/N15","v":10},{"$f":"IF(H14=\"\",0,H14)","v":10},{"$f":"IF(H14=\"\",\"\",1)","v":1}]
[null,null,null,null,null,null,"Arithmetic",{"$f":"IF('WISC IV'!F129=\"\",\"\",'WISC IV'!F129)","v":10},null,null,"Standard Score:",{"$f":"15*(L13-10)/3+100","v":100}]
[null,null,null,null,null,null,null,null,null,null,null,null,{"$f":"SUM(M12:M13)","v":20},{"$f":"SUM(N12:N13)","v":2}]
[]
[]
[null,null,null,"Low",null,null,"Block Design",{"$f":"IF('WISC IV'!F122=\"\",\"\",'WISC IV'!F122)","v":13},null,null,"Low Cultural",null,{"$f":"IF(H18=\"\",0,H18)","v":13},{"$f":"IF(H18=\"\",\"\",1)","v":1}]
[null,null,null,null,"Letter-Number Sequencing",{"$f":"IF('WISC IV'!F128=\"\",\"\",'WISC IV'!F128)","v":10},"Digit Span",{"$f":"IF('WISC IV'!F127=\"\",\"\",'WISC IV'!F127)","v":10},"Matrix Reasoning",{"$f":"IF('WISC IV'!F124=\"\",\"\",'WISC IV'!F124)","v":10},"Average:",{"$f":"M26/N26","v":9.8571428571428577},{"$f":"IF(H19=\"\",0,H19)","v":10},{"$f":"IF(H19=\"\",\"\",1)","v":1}]
[null,null,null,null,null,null,"Coding",{"$f":"IF('WISC IV'!F131=\"\",\"\",'WISC IV'!F131)","v":6},"Cancellation",{"$f":"IF('WISC IV'!F133=\"\",\"\",'WISC IV'!F133)","v":10},"Standard Score:",{"$f":"15*(L19-10)/3+100","v":99.285714285714292},{"$f":"IF(H20=\"\",0,H20)","v":6},{"$f":"IF(H20=\"\",\"\",1)","v":1}]
[null,null,null,null,null,null,"Symbol Search",{"$f":"IF('WISC IV'!F132=\"\",\"\",'WISC IV'!F132)","v":10},null,null,null,null,{"$f":"IF(H21=\"\",0,H21)","v":10},{"$f":"IF(H21=\"\",\"\",1)","v":1}]
[null,null,null,null,null,null,null,null,null,null,null,null,{"$f":"IF(F19=\"\",0,F19)","v":10},{"$f":"IF(F19=\"\",\"\",1)","v":1}]
[null,null,null,null,"High Linguistic",null,"Moderate Linguistic",null,"Low Linguistic"]
[null,null,null,null,"Average:",{"$f":"F36/G36","v":10.5},"Average:",{"$f":"H36/I36","v":9.8333333333333339},"Average:",{"$f":"J36/K36","v":10},null,null,{"$f":"IF(J19=\"\",0,J19)","v":10},{"$f":"IF(J19=\"\",\"\",1)","v":1}]
[null,null,null,null,"Standard Score:",{"$f":"15*(F24-10)/3+100","v":102.5},"Standard Score:",{"$f":"15*(H24-10)/3+100","v":99.166666666666671},"Standard Score:",{"$f":"15*(J24-10)/3+100","v":100},null,null,{"$f":"IF(J20=\"\",0,J20)","v":10},{"$f":"IF(J20=\"\",\"\",1)","v":1}]
[null,null,null,null,null,null,null,null,null,null,null,null,{"$f":"SUM(M18:M25)","v":69},{"$f":"SUM(N18:N25)","v":7}]
[null,null,"Adapted from Kevin McGrew & Dawn Flanagan’s The Intelligence Test Desk Reference (ITDR): Gf-Gc Cross-Battery Assessment (Allyn & Bacon, 1998) Table 14-4 and from Dawn Flanagan, Kevin McGrew, and Samuel Ortiz's The Wechsler Intelligence Scales and Gf-Gc Theory: A Contemporary Approach to Interpretation (Allyn & Bacon, 2000 Table 8.2."]
[]
[]
[null,null,null,null,null,{"$f":"IF(F5=\"\",0,F5)","v":11},{"$f":"IF(F5=\"\",\"\",1)","v":1},{"$f":"IF(H13=\"\",0,H13)","v":10},{"$f":"IF(H13=\"\",\"\",1)","v":1},{"$f":"IF(F19=\"\",0,F19)","v":10},{"$f":"IF(F19=\"\",\"\",1)","v":1}]
[null,null,null,null,null,{"$f":"IF(F6=\"\",0,F6)","v":11},{"$f":"IF(F6=\"\",\"\",1)","v":1},{"$f":"IF(H14=\"\",0,H14)","v":10},{"$f":"IF(H14=\"\",\"\",1)","v":1}]
[null,null,null,null,null,{"$f":"IF(F7=\"\",0,F7)","v":11},{"$f":"IF(F7=\"\",\"\",1)","v":1},{"$f":"IF(H18=\"\",0,H18)","v":13},{"$f":"IF(H18=\"\",\"\",1)","v":1}]
[null,null,null,null,null,{"$f":"IF(F8=\"\",0,F8)","v":10},{"$f":"IF(F8=\"\",\"\",1)","v":1},{"$f":"IF(H19=\"\",0,H19)","v":10},{"$f":"IF(H19=\"\",\"\",1)","v":1}]
[null,null,null,null,null,{"$f":"IF(F9=\"\",0,F9)","v":10},{"$f":"IF(F9=\"\",\"\",1)","v":1},{"$f":"IF(H20=\"\",0,H20)","v":6},{"$f":"IF(H20=\"\",\"\",1)","v":1},{"$f":"IF(J19=\"\",0,J19)","v":10},{"$f":"IF(J19=\"\",\"\",1)","v":1}]
[null,null,null,null,null,{"$f":"IF(F19=\"\",0,F19)","v":10},{"$f":"IF(F19=\"\",\"\",1)","v":1},{"$f":"IF(H21=\"\",0,H21)","v":10},{"$f":"IF(H21=\"\",\"\",1)","v":1},{"$f":"IF(J20=\"\",0,J20)","v":10},{"$f":"IF(J20=\"\",\"\",1)","v":1}]
[null,null,null,null,null,{"$f":"SUM(F30:F35)","v":63},6,59,6,30,3]